HomeDefectsLIN1024-2651
Acknowledged

LIN1024-2651 : python3-numpy ptest : 4/35572 failed and log output format error on LIN1024

Created: Jul 10, 2024    Updated: Aug 21, 2024
Found In Version: 10.24.33.1
Severity: Standard
Applicable for: Wind River Linux LTS 24
Component/s: Userspace

Description

 

During the Python3-numpy testing, there were 4 failed cases, and a log output format error occurred. The correct format should be: 'result:testname'.

1)Reproduce steps
$ setup.sh   --machine intel-x86-64 --dl-layers=1 --distros wrlinux --templates feature/xfce feature/aws feature/bcc feature/bpf feature/bpftrace feature/criu feature/fortran feature/ipv6 feature/lapack feature/lttng feature/mariadb feature/network-bond-libteam feature/nftables feature/package-management feature/podman feature/ptest feature/snmp feature/unit-test feature/valgrind feature/virt-host --layers meta-aws meta-iot-cloud meta-virtualization --dl-layers=1

$ . ./oe-init-build-env

$ vim conf/local.conf

$ IMAGE_INSTALL:append = "  python3 python3-numpy"

$ bitbake wrlinux-image-small

$ ptest-runner python3-numpy

2)FAILED log :

=========================== short test summary info ============================

FAILED f2py/tests/test_f2py2e.py::test_untitled_cli - FileNotFoundError: [Err...

FAILED f2py/tests/test_f2py2e.py::test_no_py312_distutils_fcompiler - FileNot...

FAILED random/tests/test_extending.py::test_cython - FileNotFoundError: [Errn...

FAILED tests/test_public_api.py::test_all_modules_are_expected - AssertionErr...

3)Format error:

============================= test session starts ==============================

_pyinstaller/test_pyinstaller.py ss                                      [  0%]
array_api/tests/test_array_object.py ........................            [  0%]
array_api/tests/test_creation_functions.py ..............                [  0%]
array_api/tests/test_data_type_functions.py .....                        [  0%]
array_api/tests/test_elementwise_functions.py ..                         [  0%]
array_api/tests/test_indexing_functions.py ....                          [  0%]
array_api/tests/test_manipulation_functions.py ...                       [  0%]
array_api/tests/test_set_functions.py ..                                 [  0%]

 

Steps to Reproduce

1. build

 

$ setup.sh   --machine intel-x86-64 --dl-layers=1 --distros wrlinux --templates feature/xfce feature/aws feature/bcc feature/bpf feature/bpftrace feature/criu feature/fortran feature/ipv6 feature/lapack feature/lttng feature/mariadb feature/network-bond-libteam feature/nftables feature/package-management feature/podman feature/ptest feature/snmp feature/unit-test feature/valgrind feature/virt-host --layers meta-aws meta-iot-cloud meta-virtualization --dl-layers=1

 

 

$ . ./oe-init-build-env

 

3 vim conf/local.conf

 

 IMAGE_INSTALL:append = "  python3 python3-numpy"

 

4) bitbake wrlinux-image-std

 

 5) boot the target and run commands per problem description

 

 ptest-runner python3-numpy