Wind River Support Network

HomeDefectsLIN5-99
Fixed

LIN5-99 : nc6-1.0 build error on wrl501 LX05 for intel-xeoon-core-32 cgl+glibc_cgl

Created: May 24, 2013    Updated: Dec 19, 2017
Resolved Date: Jun 4, 2013
Found In Version: 5.0.1
Fix Version: 5.0.1.4
Severity: Severe
Applicable for: Wind River Linux 5
Component/s: Networking

Description

Problem Description
======================
intel-xeon-core-32 glibc_cgl build error

 
Expected Behavior
======================
build no error

Observed Behavior
======================
OE Build Configuration:
BB_VERSION        = "1.17.1"
TARGET_ARCH       = "i586"
TARGET_OS         = "linux"
MACHINE           = "intel-xeon-core-32"
DISTRO            = "wrlinux"
DISTRO_VERSION    = "5.0.1.4"
TUNE_FEATURES     = "m32 core2"
TARGET_FPU        = ""
wrlinux           = "LB34_5.0.1_RCPL0004:13a51e9a30aba54a1a89dcbea63071c3a3b30872"
wrlcompat         = "LB34_5.0.1_RCPL0004:dce69af19cca3d0b84fd0398da2b8582f1938876"
wr-toolchain      = "LB34_5.0.1_RCPL0004:2e371e110f35287e6301c472aacb8548ca826b5c"
meta              = "LB34_5.0.1_RCPL0004:d8df47be5b1ae63f418d47c56a9806bcdb3108c8"
oe-core-dl
meta-downloads    = "<unknown>:<unknown>"
wr-kernel         = "LB34_5.0.1_RCPL0004:7036372acc4eec578efb844e20f165291d14fed2"
intel-xeon-core   = "LB34_5.0.1_RCPL0004:f23498a217de921a545ca3b99f7c19733e81086d"
wr-base           = "LB34_5.0.1_RCPL0004:e0c7239d0873c7c65c8fa82f05e2847dad29dc71"
wr-features       = "LB34_5.0.1_RCPL0004:ef6cc6408ca15f10e6a5315347a04f55e97e30e7"
wr-tools-profile  = "LB34_5.0.1_RCPL0004:70afedbda832a92aa1f2c4f19d4e15387c1bb06c"
wr-tools-debug    = "LB34_5.0.1_RCPL0004:1d613783031781cbf2e538b2e0d16eaa0c8c7ccf"
meta-networking   = "LB34_5.0.1_RCPL0004:c607774d2c412191e6e65f498abd68f746d4f7c5"
meta-webserver    = "LB34_5.0.1_RCPL0004:b21fcbedec533f09a3bdcc294aac8c789778138f"
wr-prebuilts      = "<unknown>:<unknown>"
meta-selinux      = "LB34_5.0.1_RCPL0004:75b0dc5ca8fa7b0bb24bac381a6516a294e0d40a"
wr-security       = "LB34_5.0.1_RCPL0004:4d1db39300069e28830699bb4cc09c176ae6a5c8"
cgp               = "LB34_5.0.1_RCPL0004:41f130eb045beba2a429eb1fd9c703b0d36e6290"
wr-intel-support  = "LB34_5.0.1_RCPL0004:8404a5f5056176f28c706d3fb105ab780c384c28"
bts
kts               = "WRLINUX_Penguin_async:d143e6b4b7f8d6c642e5a09855d1315da7fd5622"
local             = "<unknown>:<unknown>"

NOTE: Resolving any missing task queue dependencies
NOTE: Preparing runqueue
NOTE: Executing SetScene Tasks
NOTE: Executing RunQueue Tasks
NOTE: validating kernel configuration
[non-hardware (55)]: meta/cfg/cgl/intel-xeon-core-32/specified_non_hdw.cfg
   This BSP sets config options that are possibly non-hardware related.

[invalid (4)]: meta/cfg/cgl/intel-xeon-core-32/invalid.cfg
   This BSP sets config options that are not offered anywhere within this kernel

[mismatch (11)]: meta/cfg/cgl/intel-xeon-core-32/mismatch.cfg
   There were hardware options requested that do not
   have a corresponding value present in the final ".config" file.
   This probably means you aren't getting the config you wanted.

ERROR: Function failed: do_compile (see /project/test_occ_cgl_32/bitbake_build/tmp/work/core2-wrs-linux/nc6-1.0-r0/temp/do_compile/log.do_compile.27948 for further information)
ERROR: Logfile of failure stored in: /project/test_occ_cgl_32/bitbake_build/tmp/work/core2-wrs-linux/nc6-1.0-r0/temp/do_compile/log.do_compile.27948
Log data follows:
| DEBUG: SITE files ['endian-little', 'bit-32', 'ix86-common', 'common-linux', 'common-glibc', 'i586-linux', 'common']
| DEBUG: Executing shell function do_compile
| NOTE: make -j 16
| make  all-recursive
| make[1]: Entering directory `/project/test_occ_cgl_32/bitbake_build/tmp/work/core2-wrs-linux/nc6-1.0-r0/nc6-1.0'
| Making all in config
| make[2]: Entering directory `/project/test_occ_cgl_32/bitbake_build/tmp/work/core2-wrs-linux/nc6-1.0-r0/nc6-1.0/config'
| make[2]: Nothing to be done for `all'.
| make[2]: Leaving directory `/project/test_occ_cgl_32/bitbake_build/tmp/work/core2-wrs-linux/nc6-1.0-r0/nc6-1.0/config'
| Making all in intl
| make[2]: Entering directory `/project/test_occ_cgl_32/bitbake_build/tmp/work/core2-wrs-linux/nc6-1.0-r0/nc6-1.0/intl'
| make[2]: Nothing to be done for `all'.
| make[2]: Leaving directory `/project/test_occ_cgl_32/bitbake_build/tmp/work/core2-wrs-linux/nc6-1.0-r0/nc6-1.0/intl'
| Making all in contrib
| make[2]: Entering directory `/project/test_occ_cgl_32/bitbake_build/tmp/work/core2-wrs-linux/nc6-1.0-r0/nc6-1.0/contrib'
| make[2]: Nothing to be done for `all'.
| make[2]: Leaving directory `/project/test_occ_cgl_32/bitbake_build/tmp/work/core2-wrs-linux/nc6-1.0-r0/nc6-1.0/contrib'
| Making all in src
| make[2]: Entering directory `/project/test_occ_cgl_32/bitbake_build/tmp/work/core2-wrs-linux/nc6-1.0-r0/nc6-1.0/src'
| core2-wrswrap-linux-gnu-gcc  -m32 --sysroot=/project/test_occ_cgl_32/bitbake_build/tmp/sysroots/intel-xeon-core-32 -DHAVE_CONFIG_H -I. -I..  -I../contrib -I../intl -DLOCALEDIR=\"/usr/share/locale\"  -O2 -pipe -g   -pipe -W -Wall -Wpointer-arith -Wstrict-prototypes -Wcast-qual -Wcast-align -finline-functions -O2 -pipe -g -c bluez.c
| core2-wrswrap-linux-gnu-gcc  -m32 --sysroot=/project/test_occ_cgl_32/bitbake_build/tmp/sysroots/intel-xeon-core-32 -O2 -pipe -g   -pipe -W -Wall -Wpointer-arith -Wstrict-prototypes -Wcast-qual -Wcast-align -finline-functions -O2 -pipe -g  -Wl,-O1 -Wl,--hash-style=gnu -o nc6 circ_buf.o main.o misc.o network.o afindep.o netsupport.o parser.o readwrite.o io_stream.o connection.o bluez.o ../contrib/libnc6contrib.a  -lbluetooth
| bluez.o: In function `getbluezname':
| /project/test_occ_cgl_32/bitbake_build/tmp/work/core2-wrs-linux/nc6-1.0-r0/nc6-1.0/src/bluez.c:322: undefined reference to `safe_ba2str'
| /project/test_occ_cgl_32/bitbake_build/tmp/work/core2-wrs-linux/nc6-1.0-r0/nc6-1.0/src/bluez.c:316: undefined reference to `safe_ba2str'
| collect2: ld returned 1 exit status
| make[2]: *** [nc6] Error 1
| make[2]: Leaving directory `/project/test_occ_cgl_32/bitbake_build/tmp/work/core2-wrs-linux/nc6-1.0-r0/nc6-1.0/src'
| make[1]: *** [all-recursive] Error 1
| make[1]: Leaving directory `/project/test_occ_cgl_32/bitbake_build/tmp/work/core2-wrs-linux/nc6-1.0-r0/nc6-1.0'
| make: *** [all] Error 2
| ERROR: oe_runmake failed
| WARNING: /project/test_occ_cgl_32/bitbake_build/tmp/work/core2-wrs-linux/nc6-1.0-r0/temp/do_compile/run.do_compile.27948:110 exit 1 from
|   exit 1
| ERROR: Function failed: do_compile (see /project/test_occ_cgl_32/bitbake_build/tmp/work/core2-wrs-linux/nc6-1.0-r0/temp/do_compile/log.do_compile.27948 for further information)
ERROR: Task 2678 (/project/test_occ_cgl_32/bitbake_build/../layers/wr-features/recipes-networking/nc6/nc6_1.0.bb, do_compile) failed with exit code '1'
NOTE: Tasks Summary: Attempted 4627 tasks of which 2913 didn't need to be rerun and 1 failed.
Waiting for 0 running tasks to finish:

Summary: 1 task failed:
/project/test_occ_cgl_32/bitbake_build/../layers/wr-features/recipes-networking/nc6/nc6_1.0.bb, do_compile
Summary: There was 1 ERROR message shown, returning a non-zero exit code.
make: *** [export/intel-xeon-core-32-glibc-cgl-cgl-dist.tar.bz2] Error 1 



Misc Info
======================

build host: pek-lpgbuild7

Workaround

N/A

Steps to Reproduce

1. configure --enable-kernel=cgl --enable-rootfs=glibc_cgl --enable-board=intel-xeon-core-32 --enable-test=yes --with-layer=wr-intel-support,wr-features,/wr-testing/bts,/wr-testing/kts --with-template=feature/intel-support,feature/kexec,feature/kdump --enable-jobs=16 --enable-parallel-pkgbuilds=16 --enable-reconfig --with-rcpl-version=0004

2. make fs 

Other Downloads


Live chat
Online