Wind River Support Network

HomeDefectsLIN5-9191
Fixed

LIN5-9191 : [50111]qt-x11-free-native_3.3.5 failed (d0_compile) on SLED-11.3-64bit

Created: Jan 2, 2014    Updated: Dec 19, 2017
Resolved Date: Jan 22, 2014
Found In Version: 5.0.1.11
Fix Version: 5.0.1.12
Severity: Standard
Applicable for: Wind River Linux 5
Component/s: Userspace

Description

| make[4]: Entering directory `/buildarea1/build/01021316-ccache_sstate_bbw-ccache_sstate_bbw_bsp_RCPL0011-LX02/combo1-intel-xeon-core-cgl-glibc-cgl/bitbake_build/tmp/work/x86_64-linux/qt-x11-free-native-3.3.5-r4/qt-x11-free-3.3.5/tools/designer/uic'
| /buildarea1/build/01021316-ccache_sstate_bbw-ccache_sstate_bbw_bsp_RCPL0011-LX02/combo1-intel-xeon-core-cgl-glibc-cgl/bitbake_build/tmp/work/x86_64-linux/qt-x11-free-native-3.3.5-r4/qt-x11-free-3.3.5/bin/qmake  -spec /buildarea1/build/01021316-ccache_sstate_bbw-ccache_sstate_bbw_bsp_RCPL0011-LX02/combo1-intel-xeon-core-cgl-glibc-cgl/bitbake_build/tmp/work/x86_64-linux/qt-x11-free-native-3.3.5-r4/qt-x11-free-3.3.5/mkspecs/linux-g++ -o /buildarea1/build/01021316-ccache_sstate_bbw-ccache_sstate_bbw_bsp_RCPL0011-LX02/combo1-intel-xeon-core-cgl-glibc-cgl/bitbake_build/tmp/work/x86_64-linux/qt-x11-free-native-3.3.5-r4/qt-x11-free-3.3.5/./tools/designer/uic /buildarea1/build/01021316-ccache_sstate_bbw-ccache_sstate_bbw_bsp_RCPL0011-LX02/combo1-intel-xeon-core-cgl-glibc-cgl/bitbake_build/tmp/work/x86_64-linux/qt-x11-free-native-3.3.5-r4/qt-x11-free-3.3.5/tools/designer/uic/uic.pro
| cd /buildarea1/build/01021316-ccache_sstate_bbw-ccache_sstate_bbw_bsp_RCPL0011-LX02/combo1-intel-xeon-core-cgl-glibc-cgl/bitbake_build/tmp/work/x86_64-linux/qt-x11-free-native-3.3.5-r4/qt-x11-free-3.3.5/./tools/designer/uic
| make Makefile
| make[5]: Entering directory `/buildarea1/build/01021316-ccache_sstate_bbw-ccache_sstate_bbw_bsp_RCPL0011-LX02/combo1-intel-xeon-core-cgl-glibc-cgl/bitbake_build/tmp/work/x86_64-linux/qt-x11-free-native-3.3.5-r4/qt-x11-free-3.3.5/tools/designer/uic'
| make[5]: `Makefile' is up to date.
| make[5]: Leaving directory `/buildarea1/build/01021316-ccache_sstate_bbw-ccache_sstate_bbw_bsp_RCPL0011-LX02/combo1-intel-xeon-core-cgl-glibc-cgl/bitbake_build/tmp/work/x86_64-linux/qt-x11-free-native-3.3.5-r4/qt-x11-free-3.3.5/tools/designer/uic'
| make[4]: Leaving directory `/buildarea1/build/01021316-ccache_sstate_bbw-ccache_sstate_bbw_bsp_RCPL0011-LX02/combo1-intel-xeon-core-cgl-glibc-cgl/bitbake_build/tmp/work/x86_64-linux/qt-x11-free-native-3.3.5-r4/qt-x11-free-3.3.5/tools/designer/uic'
| make[4]: Entering directory `/buildarea1/build/01021316-ccache_sstate_bbw-ccache_sstate_bbw_bsp_RCPL0011-LX02/combo1-intel-xeon-core-cgl-glibc-cgl/bitbake_build/tmp/work/x86_64-linux/qt-x11-free-native-3.3.5-r4/qt-x11-free-3.3.5/tools/designer/uic'
| g++ -c -pipe -I/buildarea1/build/01021316-ccache_sstate_bbw-ccache_sstate_bbw_bsp_RCPL0011-LX02/combo1-intel-xeon-core-cgl-glibc-cgl/bitbake_build/tmp/sysroots/x86_64-linux/usr/include -fno-exceptions -Wall -W -O2 -D_REENTRANT  -DQT_INTERNAL_XML -DUIC -DQT_NO_DEBUG -DQT_THREAD_SUPPORT -DQT_SHARED -I/buildarea1/build/01021316-ccache_sstate_bbw-ccache_sstate_bbw_bsp_RCPL0011-LX02/combo1-intel-xeon-core-cgl-glibc-cgl/bitbake_build/tmp/work/x86_64-linux/qt-x11-free-native-3.3.5-r4/qt-x11-free-3.3.5/mkspecs/linux-g++ -I. -I../shared -I../../../include -I/usr/X11R6/include -I/usr/X11R6/include -I.moc/release-shared-mt/ -o .obj/release-shared-mt/main.o main.cpp
| g++ -c -pipe -I/buildarea1/build/01021316-ccache_sstate_bbw-ccache_sstate_bbw_bsp_RCPL0011-LX02/combo1-intel-xeon-core-cgl-glibc-cgl/bitbake_build/tmp/sysroots/x86_64-linux/usr/include -fno-exceptions -Wall -W -O2 -D_REENTRANT  -DQT_INTERNAL_XML -DUIC -DQT_NO_DEBUG -DQT_THREAD_SUPPORT -DQT_SHARED -I/buildarea1/build/01021316-ccache_sstate_bbw-ccache_sstate_bbw_bsp_RCPL0011-LX02/combo1-intel-xeon-core-cgl-glibc-cgl/bitbake_build/tmp/work/x86_64-linux/qt-x11-free-native-3.3.5-r4/qt-x11-free-3.3.5/mkspecs/linux-g++ -I. -I../shared -I../../../include -I/usr/X11R6/include -I/usr/X11R6/include -I.moc/release-shared-mt/ -o .obj/release-shared-mt/uic.o uic.cpp
| g++ -c -pipe -I/buildarea1/build/01021316-ccache_sstate_bbw-ccache_sstate_bbw_bsp_RCPL0011-LX02/combo1-intel-xeon-core-cgl-glibc-cgl/bitbake_build/tmp/sysroots/x86_64-linux/usr/include -fno-exceptions -Wall -W -O2 -D_REENTRANT  -DQT_INTERNAL_XML -DUIC -DQT_NO_DEBUG -DQT_THREAD_SUPPORT -DQT_SHARED -I/buildarea1/build/01021316-ccache_sstate_bbw-ccache_sstate_bbw_bsp_RCPL0011-LX02/combo1-intel-xeon-core-cgl-glibc-cgl/bitbake_build/tmp/work/x86_64-linux/qt-x11-free-native-3.3.5-r4/qt-x11-free-3.3.5/mkspecs/linux-g++ -I. -I../shared -I../../../include -I/usr/X11R6/include -I/usr/X11R6/include -I.moc/release-shared-mt/ -o .obj/release-shared-mt/form.o form.cpp
| g++ -c -pipe -I/buildarea1/build/01021316-ccache_sstate_bbw-ccache_sstate_bbw_bsp_RCPL0011-LX02/combo1-intel-xeon-core-cgl-glibc-cgl/bitbake_build/tmp/sysroots/x86_64-linux/usr/include -fno-exceptions -Wall -W -O2 -D_REENTRANT  -DQT_INTERNAL_XML -DUIC -DQT_NO_DEBUG -DQT_THREAD_SUPPORT -DQT_SHARED -I/buildarea1/build/01021316-ccache_sstate_bbw-ccache_sstate_bbw_bsp_RCPL0011-LX02/combo1-intel-xeon-core-cgl-glibc-cgl/bitbake_build/tmp/work/x86_64-linux/qt-x11-free-native-3.3.5-r4/qt-x11-free-3.3.5/mkspecs/linux-g++ -I. -I../shared -I../../../include -I/usr/X11R6/include -I/usr/X11R6/include -I.moc/release-shared-mt/ -o .obj/release-shared-mt/object.o object.cpp
| g++ -c -pipe -I/buildarea1/build/01021316-ccache_sstate_bbw-ccache_sstate_bbw_bsp_RCPL0011-LX02/combo1-intel-xeon-core-cgl-glibc-cgl/bitbake_build/tmp/sysroots/x86_64-linux/usr/include -fno-exceptions -Wall -W -O2 -D_REENTRANT  -DQT_INTERNAL_XML -DUIC -DQT_NO_DEBUG -DQT_THREAD_SUPPORT -DQT_SHARED -I/buildarea1/build/01021316-ccache_sstate_bbw-ccache_sstate_bbw_bsp_RCPL0011-LX02/combo1-intel-xeon-core-cgl-glibc-cgl/bitbake_build/tmp/work/x86_64-linux/qt-x11-free-native-3.3.5-r4/qt-x11-free-3.3.5/mkspecs/linux-g++ -I. -I../shared -I../../../include -I/usr/X11R6/include -I/usr/X11R6/include -I.moc/release-shared-mt/ -o .obj/release-shared-mt/subclassing.o subclassing.cpp
| g++ -c -pipe -I/buildarea1/build/01021316-ccache_sstate_bbw-ccache_sstate_bbw_bsp_RCPL0011-LX02/combo1-intel-xeon-core-cgl-glibc-cgl/bitbake_build/tmp/sysroots/x86_64-linux/usr/include -fno-exceptions -Wall -W -O2 -D_REENTRANT  -DQT_INTERNAL_XML -DUIC -DQT_NO_DEBUG -DQT_THREAD_SUPPORT -DQT_SHARED -I/buildarea1/build/01021316-ccache_sstate_bbw-ccache_sstate_bbw_bsp_RCPL0011-LX02/combo1-intel-xeon-core-cgl-glibc-cgl/bitbake_build/tmp/work/x86_64-linux/qt-x11-free-native-3.3.5-r4/qt-x11-free-3.3.5/mkspecs/linux-g++ -I. -I../shared -I../../../include -I/usr/X11R6/include -I/usr/X11R6/include -I.moc/release-shared-mt/ -o .obj/release-shared-mt/embed.o embed.cpp
| In file included from embed.cpp:29:
| ../../../include/qimage.h: In member function 'bool QImageTextKeyLang::operator<(const QImageTextKeyLang&) const':
| ../../../include/qimage.h:58: warning: suggest parentheses around && within ||
| g++ -c -pipe -I/buildarea1/build/01021316-ccache_sstate_bbw-ccache_sstate_bbw_bsp_RCPL0011-LX02/combo1-intel-xeon-core-cgl-glibc-cgl/bitbake_build/tmp/sysroots/x86_64-linux/usr/include -fno-exceptions -Wall -W -O2 -D_REENTRANT  -DQT_INTERNAL_XML -DUIC -DQT_NO_DEBUG -DQT_THREAD_SUPPORT -DQT_SHARED -I/buildarea1/build/01021316-ccache_sstate_bbw-ccache_sstate_bbw_bsp_RCPL0011-LX02/combo1-intel-xeon-core-cgl-glibc-cgl/bitbake_build/tmp/work/x86_64-linux/qt-x11-free-native-3.3.5-r4/qt-x11-free-3.3.5/mkspecs/linux-g++ -I. -I../shared -I../../../include -I/usr/X11R6/include -I/usr/X11R6/include -I.moc/release-shared-mt/ -o .obj/release-shared-mt/widgetdatabase.o ../shared/widgetdatabase.cpp
| g++ -c -pipe -I/buildarea1/build/01021316-ccache_sstate_bbw-ccache_sstate_bbw_bsp_RCPL0011-LX02/combo1-intel-xeon-core-cgl-glibc-cgl/bitbake_build/tmp/sysroots/x86_64-linux/usr/include -fno-exceptions -Wall -W -O2 -D_REENTRANT  -DQT_INTERNAL_XML -DUIC -DQT_NO_DEBUG -DQT_THREAD_SUPPORT -DQT_SHARED -I/buildarea1/build/01021316-ccache_sstate_bbw-ccache_sstate_bbw_bsp_RCPL0011-LX02/combo1-intel-xeon-core-cgl-glibc-cgl/bitbake_build/tmp/work/x86_64-linux/qt-x11-free-native-3.3.5-r4/qt-x11-free-3.3.5/mkspecs/linux-g++ -I. -I../shared -I../../../include -I/usr/X11R6/include -I/usr/X11R6/include -I.moc/release-shared-mt/ -o .obj/release-shared-mt/domtool.o ../shared/domtool.cpp
| g++ -c -pipe -I/buildarea1/build/01021316-ccache_sstate_bbw-ccache_sstate_bbw_bsp_RCPL0011-LX02/combo1-intel-xeon-core-cgl-glibc-cgl/bitbake_build/tmp/sysroots/x86_64-linux/usr/include -fno-exceptions -Wall -W -O2 -D_REENTRANT  -DQT_INTERNAL_XML -DUIC -DQT_NO_DEBUG -DQT_THREAD_SUPPORT -DQT_SHARED -I/buildarea1/build/01021316-ccache_sstate_bbw-ccache_sstate_bbw_bsp_RCPL0011-LX02/combo1-intel-xeon-core-cgl-glibc-cgl/bitbake_build/tmp/work/x86_64-linux/qt-x11-free-native-3.3.5-r4/qt-x11-free-3.3.5/mkspecs/linux-g++ -I. -I../shared -I../../../include -I/usr/X11R6/include -I/usr/X11R6/include -I.moc/release-shared-mt/ -o .obj/release-shared-mt/parser.o ../shared/parser.cpp
| test -d ../../../bin/ || mkdir -p ../../../bin/
| g++ -fno-exceptions  -Wl,-rpath,/buildarea1/build/01021316-ccache_sstate_bbw-ccache_sstate_bbw_bsp_RCPL0011-LX02/combo1-intel-xeon-core-cgl-glibc-cgl/bitbake_build/tmp/sysroots/x86_64-linux/usr/lib -o ../../../bin/uic .obj/release-shared-mt/main.o .obj/release-shared-mt/uic.o .obj/release-shared-mt/form.o .obj/release-shared-mt/object.o .obj/release-shared-mt/subclassing.o .obj/release-shared-mt/embed.o .obj/release-shared-mt/widgetdatabase.o .obj/release-shared-mt/domtool.o .obj/release-shared-mt/parser.o    -L/buildarea1/build/01021316-ccache_sstate_bbw-ccache_sstate_bbw_bsp_RCPL0011-LX02/combo1-intel-xeon-core-cgl-glibc-cgl/bitbake_build/tmp/sysroots/x86_64-linux/usr/lib -L/buildarea1/build/01021316-ccache_sstate_bbw-ccache_sstate_bbw_bsp_RCPL0011-LX02/combo1-intel-xeon-core-cgl-glibc-cgl/bitbake_build/tmp/work/x86_64-linux/qt-x11-free-native-3.3.5-r4/qt-x11-free-3.3.5/lib -L/usr/X11R6/lib -L/usr/X11R6/lib -lqt-mt -lGLU -lGL -lXmu -lXext -lX11 -lm -ldl -lpthread
| /usr/lib64/libxcb-xlib.so.0: undefined reference to `_xcb_unlock_io'
| /usr/lib64/libxcb-xlib.so.0: undefined reference to `_xcb_lock_io'
| collect2: ld returned 1 exit status
| make[4]: *** [../../../bin/uic] Error 1
| make[4]: Leaving directory `/buildarea1/build/01021316-ccache_sstate_bbw-ccache_sstate_bbw_bsp_RCPL0011-LX02/combo1-intel-xeon-core-cgl-glibc-cgl/bitbake_build/tmp/work/x86_64-linux/qt-x11-free-native-3.3.5-r4/qt-x11-free-3.3.5/tools/designer/uic'
| make[3]: *** [sub-uic] Error 2
| make[3]: Leaving directory `/buildarea1/build/01021316-ccache_sstate_bbw-ccache_sstate_bbw_bsp_RCPL0011-LX02/combo1-intel-xeon-core-cgl-glibc-cgl/bitbake_build/tmp/work/x86_64-linux/qt-x11-free-native-3.3.5-r4/qt-x11-free-3.3.5/tools/designer'
| make[2]: *** [sub-designer] Error 2
| make[2]: Leaving directory `/buildarea1/build/01021316-ccache_sstate_bbw-ccache_sstate_bbw_bsp_RCPL0011-LX02/combo1-intel-xeon-core-cgl-glibc-cgl/bitbake_build/tmp/work/x86_64-linux/qt-x11-free-native-3.3.5-r4/qt-x11-free-3.3.5/tools'
| make[1]: *** [sub-tools] Error 2
| make[1]: Leaving directory `/buildarea1/build/01021316-ccache_sstate_bbw-ccache_sstate_bbw_bsp_RCPL0011-LX02/combo1-intel-xeon-core-cgl-glibc-cgl/bitbake_build/tmp/work/x86_64-linux/qt-x11-free-native-3.3.5-r4/qt-x11-free-3.3.5'
| make: *** [init] Error 2
| ERROR: oe_runmake failed
| WARNING: /buildarea1/build/01021316-ccache_sstate_bbw-ccache_sstate_bbw_bsp_RCPL0011-LX02/combo1-intel-xeon-core-cgl-glibc-cgl/bitbake_build/tmp/work/x86_64-linux/qt-x11-free-native-3.3.5-r4/temp/do_compile/run.do_compile.12706:114 exit 1 from
|   exit 1
| ERROR: Function failed: do_compile (see /buildarea1/build/01021316-ccache_sstate_bbw-ccache_sstate_bbw_bsp_RCPL0011-LX02/combo1-intel-xeon-core-cgl-glibc-cgl/bitbake_build/tmp/work/x86_64-linux/qt-x11-free-native-3.3.5-r4/temp/do_compile/log.do_compile.12706 for further information)


log link:
http://pek-rth-vm1.wrs.com/publiclog/wrl501RCPLX/buildsystem/ccache_sstate_bbw/SLED-11.3-64bit/RCPL0011-LX02/intel-xeon-core_cgl_glibc-cgl/3_make-bbc-BBCMD-bitbake-k-world.log

Steps to Reproduce

1)configure --enable-board=intel-xeon-core --enable-kernel=cgl --enable-rootfs=glibc-cgl --enable-ccache=yes --with-sstate-dir=/buildarea1/sstate_ccache/sstate_501RCPL --with-ccache-dir=/buildarea1/sstate_ccache/ccache_501RCPL --enable-parallel-pkgbuilds=8 --enable-jobs=8

2)make bbc BBCMD=bitbake -k world

Other Downloads


Live chat
Online