Wind River Support Network

HomeDefectsLIN5-8087
Fixed

LIN5-8087 : gnutls_2.12.17 failed (do_compile) of x86-64-kvm-guest-ovp.

Created: Nov 27, 2013    Updated: Dec 19, 2017
Resolved Date: Dec 17, 2013
Found In Version: 5.0.1.RCFL1
Fix Version: 5.0.1.11
Severity: Severe
Applicable for: Wind River Linux 5
Component/s: Userspace

Description

gnutls_2.12.17 failed (do_compile) of x86-64-kvm-guest-ovp.

Here is the tail of log.do_compile.8809:
 --------------------------------------------------
./gnutls-api.texi:5062: misplaced {
./gnutls-api.texi:5062: misplaced }
./gnutls-api.texi:5062: misplaced {
./gnutls-api.texi:5062: misplaced }
./gnutls-api.texi:5072: misplaced {
./gnutls-api.texi:5072: misplaced }
./gnutls-api.texi:5075: misplaced {
./gnutls-api.texi:5075: misplaced }
./gnutls-api.texi:5150: misplaced {
./gnutls-api.texi:5150: misplaced }
./gnutls-api.texi:5151: misplaced {
./gnutls-api.texi:5151: misplaced }
./gnutls-api.texi:5159: misplaced {
./gnutls-api.texi:5159: misplaced }
./gnutls-api.texi:5162: misplaced {
./gnutls-api.texi:5162: misplaced }
./gnutls-api.texi:5173: misplaced {
./gnutls-api.texi:5173: misplaced }
./gnutls-api.texi:5185: misplaced {
./gnutls-api.texi:5185: misplaced }
./gnutls-api.texi:5197: misplaced {
./gnutls-api.texi:5197: misplaced }
./gnutls-api.texi:5325: misplaced {
./gnutls-api.texi:5325: misplaced }
./gnutls-api.texi:5354: misplaced {
./gnutls-api.texi:5354: misplaced }
./gnutls-api.texi:5370: misplaced {
./gnutls-api.texi:5370: misplaced }
./gnutls-api.texi:5392: misplaced {
./gnutls-api.texi:5392: misplaced }
./gnutls-api.texi:5412: misplaced {
./gnutls-api.texi:5412: misplaced }
./gnutls-api.texi:5446: misplaced {
./gnutls-api.texi:5446: misplaced }
./gnutls-api.texi:5447: misplaced {
./gnutls-api.texi:5447: misplaced }
./gnutls-api.texi:5452: misplaced {
./gnutls-api.texi:5452: misplaced }
./gnutls-api.texi:5478: misplaced {
./gnutls-api.texi:5478: misplaced }
./gnutls-api.texi:5494: misplaced {
./gnutls-api.texi:5494: misplaced }
./gnutls-api.texi:5526: misplaced {
./gnutls-api.texi:5526: misplaced }
./gnutls-api.texi:5541: misplaced {
./gnutls-api.texi:5541: misplaced }
./gnutls-api.texi:5628: misplaced {
./gnutls-api.texi:5628: misplaced }
./gnutls-api.texi:5643: misplaced {
./gnutls-api.texi:5643: misplaced }
./gnutls-api.texi:5660: misplaced {
./gnutls-api.texi:5660: misplaced }
./gnutls-api.texi:5684: misplaced {
./gnutls-api.texi:5684: misplaced }
./gnutls-api.texi:5747: misplaced {
./gnutls-api.texi:5747: misplaced }
./cha-copying.texi:1: warning: node next `Copying Information' in menu `Concept Index' and in sectioning `Bibliography' differ
./cha-bib.texi:1: warning: node `Function and Data Index' is next for `Bibliography' in sectioning but not in menu
./cha-bib.texi:1: warning: node prev `Bibliography' in menu `Function and Data Index' and in sectioning `Copying Information' differ
gnutls.texi:119: warning: node next `Function and Data Index' in menu `Bibliography' and in sectioning `Concept Index' differ
gnutls.texi:119: warning: node prev `Function and Data Index' in menu `Concept Index' and in sectioning `Bibliography' differ
gnutls.texi:124: warning: node `Function and Data Index' is next for `Concept Index' in menu but not in sectioning
gnutls.texi:124: warning: node prev `Concept Index' in menu `Copying Information' and in sectioning `Function and Data Index' differ
make[4]: *** [gnutls.info] Error 1
make[4]: Leaving directory `/project/builds-2013-11-26-052203/x86-64-kvm-guest-ovp/bitbake_build/tmp/work/x86_64-wrs-linux/gnutls-2.12.17-r7.1/gnutls-2.12.17/doc'
make[3]: *** [all-recursive] Error 1
make[3]: Leaving directory `/project/builds-2013-11-26-052203/x86-64-kvm-guest-ovp/bitbake_build/tmp/work/x86_64-wrs-linux/gnutls-2.12.17-r7.1/gnutls-2.12.17/doc'
make[2]: *** [all] Error 2
make[2]: Leaving directory `/project/builds-2013-11-26-052203/x86-64-kvm-guest-ovp/bitbake_build/tmp/work/x86_64-wrs-linux/gnutls-2.12.17-r7.1/gnutls-2.12.17/doc'
make[1]: *** [all-recursive] Error 1
make[1]: Leaving directory `/project/builds-2013-11-26-052203/x86-64-kvm-guest-ovp/bitbake_build/tmp/work/x86_64-wrs-linux/gnutls-2.12.17-r7.1/gnutls-2.12.17'
make: *** [all] Error 2
ERROR: oe_runmake failed
WARNING: exit code 1 from a shell command.
ERROR: Function failed: do_compile (see /project/builds-2013-11-26-052203/x86-64-kvm-guest-ovp/bitbake_build/tmp/work/x86_64-wrs-linux/gnutls-2.12.17-r7.1/temp/do_compile/log.do_compile.8809 for further information)
 --------------------------------------------------

Steps to Reproduce

Relevant bits of the config were:
     x86-64-kvm-guest-ovp --enable-board=x86-64-kvm-guest --enable-rootfs=ovp-guest+initramfs+kvm --enable-addons=wr-ovp  --enable-bootimage=noimage

Other Downloads


Live chat
Online