Wind River Support Network

HomeDefectsLIN5-784
Fixed

LIN5-784 : boost build failure on altivec targets

Created: Mar 11, 2013    Updated: Dec 19, 2017
Resolved Date: Apr 1, 2013
Found In Version: 5.0.1
Fix Version: 5.0.1.2,5.0.1.4
Severity: Standard
Applicable for: Wind River Linux 5
Component/s: Toolchain

Description

Building boost for glibc_cgl always failed on fsl-t4xxx BSP:

DEBUG: Executing shell function do_compile
+ bjam -sTOOLS=gcc '-sGCC=ppce6500-wrswrap-linux-gnu-gcc    -mcpu=e5500 -mspe=no -mno-altivec -mcpu=e6500 -maltivec  -Wl,-O1 -Wl,--hash-style=gnu --sysroot=/t4xxx_cgl/bitbake_build/tmp/sysroots/fsl-t4xxx '\''-DBOOST_PLATFORM_CONFIG="boost/config/platform/linux.hpp"'\''' '-sGXX=ppce6500-wrswrap-linux-gnu-g++    -mcpu=e5500 -mspe=no -mno-altivec -mcpu=e6500 -maltivec  -Wl,-O1 -Wl,--hash-style=gnu --sysroot=/t4xxx_cgl/bitbake_build/tmp/sysroots/fsl-t4xxx '\''-DBOOST_PLATFORM_CONFIG="boost/config/platform/linux.hpp"'\''' -sGCC_INCLUDE_DIRECTORY=/t4xxx_cgl/bitbake_build/tmp/sysroots/fsl-t4xxx/usr/include -sGCC_STDLIB_DIRECTORY=/t4xxx_cgl/bitbake_build/tmp/sysroots/fsl-t4xxx/usr/lib -sNO_BZIP2=1 -sNO_ZLIB=1 '-sBUILD=release <optimization>space <threading>multi <inlining>on <debug-symbols>off' '-sPYTHON_VERSION=${PYTHON_VERSION}' --layout=system -sBOOST_BUILD_USER_CONFIG=/t4xxx_cgl/bitbake_build/tmp/work/ppce6500-wrs-linux/boost-1.50.0-r3.1/boost_1_50_0/tools/build/v2/user-config.jam --builddir=/t4xxx_cgl/bitbake_build/tmp/work/ppce6500-wrs-linux/boost-1.50.0-r3.1/boost_1_50_0/powerpc-wrs-linux --disable-icu --with-date_time --with-filesystem --with-graph --with-iostreams --with-program_options --with-regex --with-signals --with-system --with-test --with-thread --prefix=/usr --exec-prefix=/usr --libdir=/usr/lib --includedir=/usr/include

Building the Boost C++ Libraries.


Performing configuration checks

    - has_icu builds           : no

Component configuration:

    - chrono                   : not building
    - date_time                : building
    - exception                : not building
    - filesystem               : building
    - graph                    : building
    - graph_parallel           : not building
    - iostreams                : building
    - locale                   : not building
    - math                     : not building
    - mpi                      : not building
    - program_options          : building
    - python                   : not building
    - random                   : not building
    - regex                    : building
    - serialization            : not building
    - signals                  : building
    - system                   : building
    - test                     : building
    - thread                   : building
    - timer                    : not building
    - wave                     : not building

...patience...
...patience...
...patience...
...found 4195 targets...
...updating 274 targets...
common.mkdir stage
common.mkdir stage/lib
common.mkdir bin.v2/libs/regex/build/aca09349fdb84d131321425f6c3a38ed
gcc.compile.c++ bin.v2/libs/regex/build/aca09349fdb84d131321425f6c3a38ed/c_regex_traits.o
gcc.compile.c++ bin.v2/libs/regex/build/aca09349fdb84d131321425f6c3a38ed/cpp_regex_traits.o
gcc.compile.c++ bin.v2/libs/regex/build/aca09349fdb84d131321425f6c3a38ed/cregex.o
gcc.compile.c++ bin.v2/libs/regex/build/aca09349fdb84d131321425f6c3a38ed/fileiter.o
gcc.compile.c++ bin.v2/libs/regex/build/aca09349fdb84d131321425f6c3a38ed/icu.o
gcc.compile.c++ bin.v2/libs/regex/build/aca09349fdb84d131321425f6c3a38ed/instances.o
gcc.compile.c++ bin.v2/libs/regex/build/aca09349fdb84d131321425f6c3a38ed/posix_api.o
gcc.compile.c++ bin.v2/libs/regex/build/aca09349fdb84d131321425f6c3a38ed/regex.o
gcc.compile.c++ bin.v2/libs/regex/build/aca09349fdb84d131321425f6c3a38ed/regex_debug.o
gcc.compile.c++ bin.v2/libs/regex/build/aca09349fdb84d131321425f6c3a38ed/regex_raw_buffer.o
gcc.compile.c++ bin.v2/libs/regex/build/aca09349fdb84d131321425f6c3a38ed/regex_traits_defaults.o
gcc.compile.c++ bin.v2/libs/regex/build/aca09349fdb84d131321425f6c3a38ed/static_mutex.o
gcc.compile.c++ bin.v2/libs/regex/build/aca09349fdb84d131321425f6c3a38ed/w32_regex_traits.o
gcc.compile.c++ bin.v2/libs/regex/build/aca09349fdb84d131321425f6c3a38ed/wc_regex_traits.o
gcc.compile.c++ bin.v2/libs/regex/build/aca09349fdb84d131321425f6c3a38ed/wide_posix_api.o
gcc.compile.c++ bin.v2/libs/regex/build/aca09349fdb84d131321425f6c3a38ed/winstances.o
gcc.compile.c++ bin.v2/libs/regex/build/aca09349fdb84d131321425f6c3a38ed/usinstances.o
gcc.link.dll bin.v2/libs/regex/build/aca09349fdb84d131321425f6c3a38ed/libboost_regex.so.1.50.0
common.copy stage/lib/libboost_regex.so.1.50.0
ln-UNIX stage/lib/libboost_regex.so
common.mkdir bin.v2/libs/graph
common.mkdir bin.v2/libs/graph/build
common.mkdir bin.v2/libs/graph/build/aca09349fdb84d131321425f6c3a38ed
gcc.compile.c++ bin.v2/libs/graph/build/aca09349fdb84d131321425f6c3a38ed/read_graphviz_new.o
In file included from ./boost/fusion/container/vector/vector_iterator.hpp:11:0,
                 from ./boost/fusion/container/vector/detail/begin_impl.hpp:10,
                 from ./boost/fusion/container/vector/vector10.hpp:18,
                 from ./boost/fusion/container/vector/vector_fwd.hpp:14,
                 from ./boost/fusion/mpl/detail/clear.hpp:10,
                 from ./boost/fusion/mpl/clear.hpp:12,
                 from ./boost/fusion/mpl.hpp:17,
                 from ./boost/fusion/view/detail/strictest_traversal.hpp:15,
                 from ./boost/fusion/view/transform_view/transform_view.hpp:20,
                 from ./boost/fusion/view/transform_view.hpp:10,
                 from ./boost/fusion/include/transform_view.hpp:10,
                 from ./boost/proto/fusion.hpp:24,
                 from ./boost/proto/core.hpp:21,
                 from ./boost/xpressive/regex_primitives.hpp:28,
                 from ./boost/xpressive/xpressive_static.hpp:24,
                 from ./boost/graph/graphviz.hpp:31,
                 from libs/graph/src/read_graphviz_new.cpp:50:
./boost/fusion/container/vector/detail/deref_impl.hpp:30:44: error: declaration does not declare anything [-fpermissive]
./boost/fusion/container/vector/detail/deref_impl.hpp:33:50: error: template argument 1 is invalid
./boost/fusion/container/vector/detail/deref_impl.hpp:33:51: error: expected identifier before '::' token
./boost/fusion/container/vector/detail/deref_impl.hpp:33:53: error: typedef name may not be a nested-name-specifier
./boost/fusion/container/vector/detail/deref_impl.hpp:33:53: error: expected ';' at end of member declaration
./boost/fusion/container/vector/detail/deref_impl.hpp:34:17: error: 'element' does not name a type
./boost/fusion/container/vector/detail/deref_impl.hpp:38:34: error: 'vector' was not declared in this scope
./boost/fusion/container/vector/detail/deref_impl.hpp:38:34: note: suggested alternatives:
/lpg-build/cdc/fast_prod/wrlinux501/dvd_install/lx34_12sp/wrlinux-5/layers/wr-toolchain/4.6a-99/bin/../lib/gcc/powerpc-wrs-linux-gnu/4.6.3/../../../../powerpc-wrs-linux-gnu/include/c++/4.6.3/bits/stl_vector.h:180:11: note:   'std::vector'
./boost/mpl/aux_/preprocessed/gcc/vector.hpp:22:8: note:   'boost::mpl::vector'
./boost/container/container_fwd.hpp:53:7: note:   'boost::container::vector'
/lpg-build/cdc/fast_prod/wrlinux501/dvd_install/lx34_12sp/wrlinux-5/layers/wr-toolchain/4.6a-99/bin/../lib/gcc/powerpc-wrs-linux-gnu/4.6.3/../../../../powerpc-wrs-linux-gnu/include/c++/4.6.3/bits/stl_vector.h:180:11: note:   'std::vector'
/lpg-build/cdc/fast_prod/wrlinux501/dvd_install/lx34_12sp/wrlinux-5/layers/wr-toolchain/4.6a-99/bin/../lib/gcc/powerpc-wrs-linux-gnu/4.6.3/../../../../powerpc-wrs-linux-gnu/include/c++/4.6.3/bits/stl_vector.h:180:11: note:   'std::vector'
/lpg-build/cdc/fast_prod/wrlinux501/dvd_install/lx34_12sp/wrlinux-5/layers/wr-toolchain/4.6a-99/bin/../lib/gcc/powerpc-wrs-linux-gnu/4.6.3/../../../../powerpc-wrs-linux-gnu/include/c++/4.6.3/bits/stl_vector.h:180:11: note:   'std::vector'
/lpg-build/cdc/fast_prod/wrlinux501/dvd_install/lx34_12sp/wrlinux-5/layers/wr-toolchain/4.6a-99/bin/../lib/gcc/powerpc-wrs-linux-gnu/4.6.3/../../../../powerpc-wrs-linux-gnu/include/c++/4.6.3/bits/stl_vector.h:180:11: note:   'std::vector'
./boost/fusion/container/vector/detail/deref_impl.hpp:38:40: error: template argument 1 is invalid
./boost/fusion/container/vector/detail/deref_impl.hpp:39:62: error: 'element' was not declared in this scope
./boost/fusion/container/vector/detail/deref_impl.hpp:39:62: note: suggested alternative:
./boost/tuple/detail/tuple_basic.hpp:125:8: note:   'boost::tuples::element'
./boost/fusion/container/vector/detail/deref_impl.hpp:39:69: error: template argument 1 is invalid
./boost/fusion/container/vector/detail/deref_impl.hpp:40:61: error: 'element' was not declared in this scope
./boost/fusion/container/vector/detail/deref_impl.hpp:40:61: note: suggested alternative:
./boost/tuple/detail/tuple_basic.hpp:125:8: note:   'boost::tuples::element'
./boost/fusion/container/vector/detail/deref_impl.hpp:40:68: error: template argument 1 is invalid
./boost/fusion/container/vector/detail/deref_impl.hpp:41:21: error: template argument 1 is invalid
./boost/fusion/container/vector/detail/deref_impl.hpp:41:21: error: template argument 2 is invalid
./boost/fusion/container/vector/detail/deref_impl.hpp:41:21: error: template argument 3 is invalid
In file included from ./boost/fusion/container/vector/vector_iterator.hpp:12:0,
                 from ./boost/fusion/container/vector/detail/begin_impl.hpp:10,
                 from ./boost/fusion/container/vector/vector10.hpp:18,
                 from ./boost/fusion/container/vector/vector_fwd.hpp:14,
                 from ./boost/fusion/mpl/detail/clear.hpp:10,
                 from ./boost/fusion/mpl/clear.hpp:12,
                 from ./boost/fusion/mpl.hpp:17,
                 from ./boost/fusion/view/detail/strictest_traversal.hpp:15,
                 from ./boost/fusion/view/transform_view/transform_view.hpp:20,
                 from ./boost/fusion/view/transform_view.hpp:10,
                 from ./boost/fusion/include/transform_view.hpp:10,
                 from ./boost/proto/fusion.hpp:24,
                 from ./boost/proto/core.hpp:21,
                 from ./boost/xpressive/regex_primitives.hpp:28,
                 from ./boost/xpressive/xpressive_static.hpp:24,
                 from ./boost/graph/graphviz.hpp:31,
                 from libs/graph/src/read_graphviz_new.cpp:50:
./boost/fusion/container/vector/detail/value_of_impl.hpp:27:44: error: declaration does not declare anything [-fpermissive]
./boost/fusion/container/vector/detail/value_of_impl.hpp:30:50: error: template argument 1 is invalid
./boost/fusion/container/vector/detail/value_of_impl.hpp:30:51: error: expected identifier before '::' token
./boost/fusion/container/vector/detail/value_of_impl.hpp:30:53: error: typedef name may not be a nested-name-specifier
./boost/fusion/container/vector/detail/value_of_impl.hpp:30:53: error: expected ';' at end of member declaration
./boost/fusion/container/vector/detail/value_of_impl.hpp:31:17: error: invalid use of template-name 'boost::type' without an argument list
In file included from ./boost/fusion/container/vector/vector_iterator.hpp:13:0,
                 from ./boost/fusion/container/vector/detail/begin_impl.hpp:10,
                 from ./boost/fusion/container/vector/vector10.hpp:18,
                 from ./boost/fusion/container/vector/vector_fwd.hpp:14,
                 from ./boost/fusion/mpl/detail/clear.hpp:10,
                 from ./boost/fusion/mpl/clear.hpp:12,
                 from ./boost/fusion/mpl.hpp:17,
                 from ./boost/fusion/view/detail/strictest_traversal.hpp:15,
                 from ./boost/fusion/view/transform_view/transform_view.hpp:20,
                 from ./boost/fusion/view/transform_view.hpp:10,
                 from ./boost/fusion/include/transform_view.hpp:10,
                 from ./boost/proto/fusion.hpp:24,
                 from ./boost/proto/core.hpp:21,
                 from ./boost/xpressive/regex_primitives.hpp:28,
                 from ./boost/xpressive/xpressive_static.hpp:24,
                 from ./boost/graph/graphviz.hpp:31,
                 from libs/graph/src/read_graphviz_new.cpp:50:
./boost/fusion/container/vector/detail/next_impl.hpp:29:44: error: declaration does not declare anything [-fpermissive]
./boost/fusion/container/vector/detail/next_impl.hpp:31:41: error: 'vector' was not declared in this scope
./boost/fusion/container/vector/detail/next_impl.hpp:31:41: note: suggested alternatives:
/lpg-build/cdc/fast_prod/wrlinux501/dvd_install/lx34_12sp/wrlinux-5/layers/wr-toolchain/4.6a-99/bin/../lib/gcc/powerpc-wrs-linux-gnu/4.6.3/../../../../powerpc-wrs-linux-gnu/include/c++/4.6.3/bits/stl_vector.h:180:11: note:   'std::vector'
./boost/mpl/aux_/preprocessed/gcc/vector.hpp:22:8: note:   'boost::mpl::vector'
./boost/container/container_fwd.hpp:53:7: note:   'boost::container::vector'
/lpg-build/cdc/fast_prod/wrlinux501/dvd_install/lx34_12sp/wrlinux-5/layers/wr-toolchain/4.6a-99/bin/../lib/gcc/powerpc-wrs-linux-gnu/4.6.3/../../../../powerpc-wrs-linux-gnu/include/c++/4.6.3/bits/stl_vector.h:180:11: note:   'std::vector'
/lpg-build/cdc/fast_prod/wrlinux501/dvd_install/lx34_12sp/wrlinux-5/layers/wr-toolchain/4.6a-99/bin/../lib/gcc/powerpc-wrs-linux-gnu/4.6.3/../../../../powerpc-wrs-linux-gnu/include/c++/4.6.3/bits/stl_vector.h:180:11: note:   'std::vector'
/lpg-build/cdc/fast_prod/wrlinux501/dvd_install/lx34_12sp/wrlinux-5/layers/wr-toolchain/4.6a-99/bin/../lib/gcc/powerpc-wrs-linux-gnu/4.6.3/../../../../powerpc-wrs-linux-gnu/include/c++/4.6.3/bits/stl_vector.h:180:11: note:   'std::vector'
/lpg-build/cdc/fast_prod/wrlinux501/dvd_install/lx34_12sp/wrlinux-5/layers/wr-toolchain/4.6a-99/bin/../lib/gcc/powerpc-wrs-linux-gnu/4.6.3/../../../../powerpc-wrs-linux-gnu/include/c++/4.6.3/bits/stl_vector.h:180:11: note:   'std::vector'
./boost/fusion/container/vector/detail/next_impl.hpp:31:63: error: template argument 1 is invalid
In file included from ./boost/fusion/container/vector/vector_iterator.hpp:14:0,
                 from ./boost/fusion/container/vector/detail/begin_impl.hpp:10,
                 from ./boost/fusion/container/vector/vector10.hpp:18,
                 from ./boost/fusion/container/vector/vector_fwd.hpp:14,
                 from ./boost/fusion/mpl/detail/clear.hpp:10,
                 from ./boost/fusion/mpl/clear.hpp:12,
                 from ./boost/fusion/mpl.hpp:17,
                 from ./boost/fusion/view/detail/strictest_traversal.hpp:15,
                 from ./boost/fusion/view/transform_view/transform_view.hpp:20,
                 from ./boost/fusion/view/transform_view.hpp:10,
                 from ./boost/fusion/include/transform_view.hpp:10,
                 from ./boost/proto/fusion.hpp:24,
                 from ./boost/proto/core.hpp:21,
                 from ./boost/xpressive/regex_primitives.hpp:28,
                 from ./boost/xpressive/xpressive_static.hpp:24,
                 from ./boost/graph/graphviz.hpp:31,
                 from libs/graph/src/read_graphviz_new.cpp:50:
./boost/fusion/container/vector/detail/prior_impl.hpp:29:44: error: declaration does not declare anything [-fpermissive]
./boost/fusion/container/vector/detail/prior_impl.hpp:31:41: error: 'vector' was not declared in this scope
./boost/fusion/container/vector/detail/prior_impl.hpp:31:41: note: suggested alternatives:
/lpg-build/cdc/fast_prod/wrlinux501/dvd_install/lx34_12sp/wrlinux-5/layers/wr-toolchain/4.6a-99/bin/../lib/gcc/powerpc-wrs-linux-gnu/4.6.3/../../../../powerpc-wrs-linux-gnu/include/c++/4.6.3/bits/stl_vector.h:180:11: note:   'std::vector'
./boost/mpl/aux_/preprocessed/gcc/vector.hpp:22:8: note:   'boost::mpl::vector'
./boost/container/container_fwd.hpp:53:7: note:   'boost::container::vector'
/lpg-build/cdc/fast_prod/wrlinux501/dvd_install/lx34_12sp/wrlinux-5/layers/wr-toolchain/4.6a-99/bin/../lib/gcc/powerpc-wrs-linux-gnu/4.6.3/../../../../powerpc-wrs-linux-gnu/include/c++/4.6.3/bits/stl_vector.h:180:11: note:   'std::vector'
/lpg-build/cdc/fast_prod/wrlinux501/dvd_install/lx34_12sp/wrlinux-5/layers/wr-toolchain/4.6a-99/bin/../lib/gcc/powerpc-wrs-linux-gnu/4.6.3/../../../../powerpc-wrs-linux-gnu/include/c++/4.6.3/bits/stl_vector.h:180:11: note:   'std::vector'
/lpg-build/cdc/fast_prod/wrlinux501/dvd_install/lx34_12sp/wrlinux-5/layers/wr-toolchain/4.6a-99/bin/../lib/gcc/powerpc-wrs-linux-gnu/4.6.3/../../../../powerpc-wrs-linux-gnu/include/c++/4.6.3/bits/stl_vector.h:180:11: note:   'std::vector'
/lpg-build/cdc/fast_prod/wrlinux501/dvd_install/lx34_12sp/wrlinux-5/layers/wr-toolchain/4.6a-99/bin/../lib/gcc/powerpc-wrs-linux-gnu/4.6.3/../../../../powerpc-wrs-linux-gnu/include/c++/4.6.3/bits/stl_vector.h:180:11: note:   'std::vector'
./boost/fusion/container/vector/detail/prior_impl.hpp:31:63: error: template argument 1 is invalid
In file included from ./boost/fusion/container/vector/vector_iterator.hpp:17:0,
                 from ./boost/fusion/container/vector/detail/begin_impl.hpp:10,
                 from ./boost/fusion/container/vector/vector10.hpp:18,
                 from ./boost/fusion/container/vector/vector_fwd.hpp:14,
                 from ./boost/fusion/mpl/detail/clear.hpp:10,
                 from ./boost/fusion/mpl/clear.hpp:12,
                 from ./boost/fusion/mpl.hpp:17,
                 from ./boost/fusion/view/detail/strictest_traversal.hpp:15,
                 from ./boost/fusion/view/transform_view/transform_view.hpp:20,
                 from ./boost/fusion/view/transform_view.hpp:10,
                 from ./boost/fusion/include/transform_view.hpp:10,
                 from ./boost/proto/fusion.hpp:24,
                 from ./boost/proto/core.hpp:21,
                 from ./boost/xpressive/regex_primitives.hpp:28,
                 from ./boost/xpressive/xpressive_static.hpp:24,
                 from ./boost/graph/graphviz.hpp:31,
                 from libs/graph/src/read_graphviz_new.cpp:50:
./boost/fusion/container/vector/detail/advance_impl.hpp:29:44: error: declaration does not declare anything [-fpermissive]
./boost/fusion/container/vector/detail/advance_impl.hpp:30:41: error: 'vector' was not declared in this scope
./boost/fusion/container/vector/detail/advance_impl.hpp:30:41: note: suggested alternatives:
/lpg-build/cdc/fast_prod/wrlinux501/dvd_install/lx34_12sp/wrlinux-5/layers/wr-toolchain/4.6a-99/bin/../lib/gcc/powerpc-wrs-linux-gnu/4.6.3/../../../../powerpc-wrs-linux-gnu/include/c++/4.6.3/bits/stl_vector.h:180:11: note:   'std::vector'
./boost/mpl/aux_/preprocessed/gcc/vector.hpp:22:8: note:   'boost::mpl::vector'
./boost/container/container_fwd.hpp:53:7: note:   'boost::container::vector'
/lpg-build/cdc/fast_prod/wrlinux501/dvd_install/lx34_12sp/wrlinux-5/layers/wr-toolchain/4.6a-99/bin/../lib/gcc/powerpc-wrs-linux-gnu/4.6.3/../../../../powerpc-wrs-linux-gnu/include/c++/4.6.3/bits/stl_vector.h:180:11: note:   'std::vector'
/lpg-build/cdc/fast_prod/wrlinux501/dvd_install/lx34_12sp/wrlinux-5/layers/wr-toolchain/4.6a-99/bin/../lib/gcc/powerpc-wrs-linux-gnu/4.6.3/../../../../powerpc-wrs-linux-gnu/include/c++/4.6.3/bits/stl_vector.h:180:11: note:   'std::vector'
/lpg-build/cdc/fast_prod/wrlinux501/dvd_install/lx34_12sp/wrlinux-5/layers/wr-toolchain/4.6a-99/bin/../lib/gcc/powerpc-wrs-linux-gnu/4.6.3/../../../../powerpc-wrs-linux-gnu/include/c++/4.6.3/bits/stl_vector.h:180:11: note:   'std::vector'
/lpg-build/cdc/fast_prod/wrlinux501/dvd_install/lx34_12sp/wrlinux-5/layers/wr-toolchain/4.6a-99/bin/../lib/gcc/powerpc-wrs-linux-gnu/4.6.3/../../../../powerpc-wrs-linux-gnu/include/c++/4.6.3/bits/stl_vector.h:180:11: note:   'std::vector'
./boost/fusion/container/vector/detail/advance_impl.hpp:30:70: error: template argument 1 is invalid

    "ppce6500-wrswrap-linux-gnu-g++" "-mcpu=e5500" "-mspe=no" "-mno-altivec" "-mcpu=e6500" "-maltivec" "-Wl,-O1" "-Wl,--hash-style=gnu" "--sysroot=/t4xxx_cgl/bitbake_build/tmp/sysroots/fsl-t4xxx"  -ftemplate-depth-128 -O3 -finline-functions -Wno-inline -Wall -pthread -fPIC  -DBOOST_ALL_NO_LIB=1 -DBOOST_GRAPH_DYN_LINK=1 -DNDEBUG  -I"." -I"libs/graph/src" -c -o "bin.v2/libs/graph/build/aca09349fdb84d131321425f6c3a38ed/read_graphviz_new.o" "libs/graph/src/read_graphviz_new.cpp"

...failed gcc.compile.c++ bin.v2/libs/graph/build/aca09349fdb84d131321425f6c3a38ed/read_graphviz_new.o...
gcc.compile.c++ bin.v2/libs/graph/build/aca09349fdb84d131321425f6c3a38ed/graphml.o
In file included from ./boost/fusion/container/vector/vector_iterator.hpp:11:0,
                 from ./boost/fusion/container/vector/detail/begin_impl.hpp:10,
                 from ./boost/fusion/container/vector/vector10.hpp:18,
                 from ./boost/fusion/container/vector/vector_fwd.hpp:14,
                 from ./boost/fusion/mpl/detail/clear.hpp:10,
                 from ./boost/fusion/mpl/clear.hpp:12,
                 from ./boost/fusion/mpl.hpp:17,
                 from ./boost/fusion/view/detail/strictest_traversal.hpp:15,
                 from ./boost/fusion/view/transform_view/transform_view.hpp:20,
                 from ./boost/fusion/view/transform_view.hpp:10,
                 from ./boost/fusion/include/transform_view.hpp:10,
                 from ./boost/proto/fusion.hpp:24,
                 from ./boost/proto/core.hpp:21,
                 from ./boost/xpressive/regex_primitives.hpp:28,
                 from ./boost/xpressive/xpressive_static.hpp:24,
                 from ./boost/graph/graphviz.hpp:31,
                 from ./boost/graph/graphml.hpp:20,
                 from libs/graph/src/graphml.cpp:17:
./boost/fusion/container/vector/detail/deref_impl.hpp:30:44: error: declaration does not declare anything [-fpermissive]
./boost/fusion/container/vector/detail/deref_impl.hpp:33:50: error: template argument 1 is invalid
./boost/fusion/container/vector/detail/deref_impl.hpp:33:51: error: expected identifier before '::' token
./boost/fusion/container/vector/detail/deref_impl.hpp:33:53: error: typedef name may not be a nested-name-specifier
./boost/fusion/container/vector/detail/deref_impl.hpp:33:53: error: expected ';' at end of member declaration
./boost/fusion/container/vector/detail/deref_impl.hpp:34:17: error: 'element' does not name a type
./boost/fusion/container/vector/detail/deref_impl.hpp:38:34: error: 'vector' was not declared in this scope
./boost/fusion/container/vector/detail/deref_impl.hpp:38:34: note: suggested alternatives:
/lpg-build/cdc/fast_prod/wrlinux501/dvd_install/lx34_12sp/wrlinux-5/layers/wr-toolchain/4.6a-99/bin/../lib/gcc/powerpc-wrs-linux-gnu/4.6.3/../../../../powerpc-wrs-linux-gnu/include/c++/4.6.3/bits/stl_vector.h:180:11: note:   'std::vector'
./boost/mpl/aux_/preprocessed/gcc/vector.hpp:22:8: note:   'boost::mpl::vector'
./boost/container/container_fwd.hpp:53:7: note:   'boost::container::vector'
/lpg-build/cdc/fast_prod/wrlinux501/dvd_install/lx34_12sp/wrlinux-5/layers/wr-toolchain/4.6a-99/bin/../lib/gcc/powerpc-wrs-linux-gnu/4.6.3/../../../../powerpc-wrs-linux-gnu/include/c++/4.6.3/bits/stl_vector.h:180:11: note:   'std::vector'
/lpg-build/cdc/fast_prod/wrlinux501/dvd_install/lx34_12sp/wrlinux-5/layers/wr-toolchain/4.6a-99/bin/../lib/gcc/powerpc-wrs-linux-gnu/4.6.3/../../../../powerpc-wrs-linux-gnu/include/c++/4.6.3/bits/stl_vector.h:180:11: note:   'std::vector'
/lpg-build/cdc/fast_prod/wrlinux501/dvd_install/lx34_12sp/wrlinux-5/layers/wr-toolchain/4.6a-99/bin/../lib/gcc/powerpc-wrs-linux-gnu/4.6.3/../../../../powerpc-wrs-linux-gnu/include/c++/4.6.3/bits/stl_vector.h:180:11: note:   'std::vector'
/lpg-build/cdc/fast_prod/wrlinux501/dvd_install/lx34_12sp/wrlinux-5/layers/wr-toolchain/4.6a-99/bin/../lib/gcc/powerpc-wrs-linux-gnu/4.6.3/../../../../powerpc-wrs-linux-gnu/include/c++/4.6.3/bits/stl_vector.h:180:11: note:   'std::vector'
./boost/fusion/container/vector/detail/deref_impl.hpp:38:40: error: template argument 1 is invalid
./boost/fusion/container/vector/detail/deref_impl.hpp:39:62: error: 'element' was not declared in this scope
./boost/fusion/container/vector/detail/deref_impl.hpp:39:62: note: suggested alternative:
./boost/tuple/detail/tuple_basic.hpp:125:8: note:   'boost::tuples::element'
./boost/fusion/container/vector/detail/deref_impl.hpp:39:69: error: template argument 1 is invalid
./boost/fusion/container/vector/detail/deref_impl.hpp:40:61: error: 'element' was not declared in this scope
./boost/fusion/container/vector/detail/deref_impl.hpp:40:61: note: suggested alternative:
./boost/tuple/detail/tuple_basic.hpp:125:8: note:   'boost::tuples::element'
./boost/fusion/container/vector/detail/deref_impl.hpp:40:68: error: template argument 1 is invalid
./boost/fusion/container/vector/detail/deref_impl.hpp:41:21: error: template argument 1 is invalid
./boost/fusion/container/vector/detail/deref_impl.hpp:41:21: error: template argument 2 is invalid
./boost/fusion/container/vector/detail/deref_impl.hpp:41:21: error: template argument 3 is invalid
In file included from ./boost/fusion/container/vector/vector_iterator.hpp:12:0,
                 from ./boost/fusion/container/vector/detail/begin_impl.hpp:10,
                 from ./boost/fusion/container/vector/vector10.hpp:18,
                 from ./boost/fusion/container/vector/vector_fwd.hpp:14,
                 from ./boost/fusion/mpl/detail/clear.hpp:10,
                 from ./boost/fusion/mpl/clear.hpp:12,
                 from ./boost/fusion/mpl.hpp:17,
                 from ./boost/fusion/view/detail/strictest_traversal.hpp:15,
                 from ./boost/fusion/view/transform_view/transform_view.hpp:20,
                 from ./boost/fusion/view/transform_view.hpp:10,
                 from ./boost/fusion/include/transform_view.hpp:10,
                 from ./boost/proto/fusion.hpp:24,
                 from ./boost/proto/core.hpp:21,
                 from ./boost/xpressive/regex_primitives.hpp:28,
                 from ./boost/xpressive/xpressive_static.hpp:24,
                 from ./boost/graph/graphviz.hpp:31,
                 from ./boost/graph/graphml.hpp:20,
                 from libs/graph/src/graphml.cpp:17:
./boost/fusion/container/vector/detail/value_of_impl.hpp:27:44: error: declaration does not declare anything [-fpermissive]
./boost/fusion/container/vector/detail/value_of_impl.hpp:30:50: error: template argument 1 is invalid
./boost/fusion/container/vector/detail/value_of_impl.hpp:30:51: error: expected identifier before '::' token
./boost/fusion/container/vector/detail/value_of_impl.hpp:30:53: error: typedef name may not be a nested-name-specifier
./boost/fusion/container/vector/detail/value_of_impl.hpp:30:53: error: expected ';' at end of member declaration
./boost/fusion/container/vector/detail/value_of_impl.hpp:31:17: error: invalid use of template-name 'boost::type' without an argument list
In file included from ./boost/fusion/container/vector/vector_iterator.hpp:13:0,
                 from ./boost/fusion/container/vector/detail/begin_impl.hpp:10,
                 from ./boost/fusion/container/vector/vector10.hpp:18,
                 from ./boost/fusion/container/vector/vector_fwd.hpp:14,
                 from ./boost/fusion/mpl/detail/clear.hpp:10,
                 from ./boost/fusion/mpl/clear.hpp:12,
                 from ./boost/fusion/mpl.hpp:17,
                 from ./boost/fusion/view/detail/strictest_traversal.hpp:15,
                 from ./boost/fusion/view/transform_view/transform_view.hpp:20,
                 from ./boost/fusion/view/transform_view.hpp:10,
                 from ./boost/fusion/include/transform_view.hpp:10,
                 from ./boost/proto/fusion.hpp:24,
                 from ./boost/proto/core.hpp:21,
                 from ./boost/xpressive/regex_primitives.hpp:28,
                 from ./boost/xpressive/xpressive_static.hpp:24,
                 from ./boost/graph/graphviz.hpp:31,
                 from ./boost/graph/graphml.hpp:20,
                 from libs/graph/src/graphml.cpp:17:
./boost/fusion/container/vector/detail/next_impl.hpp:29:44: error: declaration does not declare anything [-fpermissive]
./boost/fusion/container/vector/detail/next_impl.hpp:31:41: error: 'vector' was not declared in this scope
./boost/fusion/container/vector/detail/next_impl.hpp:31:41: note: suggested alternatives:
/lpg-build/cdc/fast_prod/wrlinux501/dvd_install/lx34_12sp/wrlinux-5/layers/wr-toolchain/4.6a-99/bin/../lib/gcc/powerpc-wrs-linux-gnu/4.6.3/../../../../powerpc-wrs-linux-gnu/include/c++/4.6.3/bits/stl_vector.h:180:11: note:   'std::vector'
./boost/mpl/aux_/preprocessed/gcc/vector.hpp:22:8: note:   'boost::mpl::vector'
./boost/container/container_fwd.hpp:53:7: note:   'boost::container::vector'
/lpg-build/cdc/fast_prod/wrlinux501/dvd_install/lx34_12sp/wrlinux-5/layers/wr-toolchain/4.6a-99/bin/../lib/gcc/powerpc-wrs-linux-gnu/4.6.3/../../../../powerpc-wrs-linux-gnu/include/c++/4.6.3/bits/stl_vector.h:180:11: note:   'std::vector'
/lpg-build/cdc/fast_prod/wrlinux501/dvd_install/lx34_12sp/wrlinux-5/layers/wr-toolchain/4.6a-99/bin/../lib/gcc/powerpc-wrs-linux-gnu/4.6.3/../../../../powerpc-wrs-linux-gnu/include/c++/4.6.3/bits/stl_vector.h:180:11: note:   'std::vector'
/lpg-build/cdc/fast_prod/wrlinux501/dvd_install/lx34_12sp/wrlinux-5/layers/wr-toolchain/4.6a-99/bin/../lib/gcc/powerpc-wrs-linux-gnu/4.6.3/../../../../powerpc-wrs-linux-gnu/include/c++/4.6.3/bits/stl_vector.h:180:11: note:   'std::vector'
/lpg-build/cdc/fast_prod/wrlinux501/dvd_install/lx34_12sp/wrlinux-5/layers/wr-toolchain/4.6a-99/bin/../lib/gcc/powerpc-wrs-linux-gnu/4.6.3/../../../../powerpc-wrs-linux-gnu/include/c++/4.6.3/bits/stl_vector.h:180:11: note:   'std::vector'
./boost/fusion/container/vector/detail/next_impl.hpp:31:63: error: template argument 1 is invalid
In file included from ./boost/fusion/container/vector/vector_iterator.hpp:14:0,
                 from ./boost/fusion/container/vector/detail/begin_impl.hpp:10,
                 from ./boost/fusion/container/vector/vector10.hpp:18,
                 from ./boost/fusion/container/vector/vector_fwd.hpp:14,
                 from ./boost/fusion/mpl/detail/clear.hpp:10,
                 from ./boost/fusion/mpl/clear.hpp:12,
                 from ./boost/fusion/mpl.hpp:17,
                 from ./boost/fusion/view/detail/strictest_traversal.hpp:15,
                 from ./boost/fusion/view/transform_view/transform_view.hpp:20,
                 from ./boost/fusion/view/transform_view.hpp:10,
                 from ./boost/fusion/include/transform_view.hpp:10,
                 from ./boost/proto/fusion.hpp:24,
                 from ./boost/proto/core.hpp:21,
                 from ./boost/xpressive/regex_primitives.hpp:28,
                 from ./boost/xpressive/xpressive_static.hpp:24,
                 from ./boost/graph/graphviz.hpp:31,
                 from ./boost/graph/graphml.hpp:20,
                 from libs/graph/src/graphml.cpp:17:
./boost/fusion/container/vector/detail/prior_impl.hpp:29:44: error: declaration does not declare anything [-fpermissive]
./boost/fusion/container/vector/detail/prior_impl.hpp:31:41: error: 'vector' was not declared in this scope
./boost/fusion/container/vector/detail/prior_impl.hpp:31:41: note: suggested alternatives:
/lpg-build/cdc/fast_prod/wrlinux501/dvd_install/lx34_12sp/wrlinux-5/layers/wr-toolchain/4.6a-99/bin/../lib/gcc/powerpc-wrs-linux-gnu/4.6.3/../../../../powerpc-wrs-linux-gnu/include/c++/4.6.3/bits/stl_vector.h:180:11: note:   'std::vector'
./boost/mpl/aux_/preprocessed/gcc/vector.hpp:22:8: note:   'boost::mpl::vector'
./boost/container/container_fwd.hpp:53:7: note:   'boost::container::vector'
/lpg-build/cdc/fast_prod/wrlinux501/dvd_install/lx34_12sp/wrlinux-5/layers/wr-toolchain/4.6a-99/bin/../lib/gcc/powerpc-wrs-linux-gnu/4.6.3/../../../../powerpc-wrs-linux-gnu/include/c++/4.6.3/bits/stl_vector.h:180:11: note:   'std::vector'
/lpg-build/cdc/fast_prod/wrlinux501/dvd_install/lx34_12sp/wrlinux-5/layers/wr-toolchain/4.6a-99/bin/../lib/gcc/powerpc-wrs-linux-gnu/4.6.3/../../../../powerpc-wrs-linux-gnu/include/c++/4.6.3/bits/stl_vector.h:180:11: note:   'std::vector'
/lpg-build/cdc/fast_prod/wrlinux501/dvd_install/lx34_12sp/wrlinux-5/layers/wr-toolchain/4.6a-99/bin/../lib/gcc/powerpc-wrs-linux-gnu/4.6.3/../../../../powerpc-wrs-linux-gnu/include/c++/4.6.3/bits/stl_vector.h:180:11: note:   'std::vector'
/lpg-build/cdc/fast_prod/wrlinux501/dvd_install/lx34_12sp/wrlinux-5/layers/wr-toolchain/4.6a-99/bin/../lib/gcc/powerpc-wrs-linux-gnu/4.6.3/../../../../powerpc-wrs-linux-gnu/include/c++/4.6.3/bits/stl_vector.h:180:11: note:   'std::vector'
./boost/fusion/container/vector/detail/prior_impl.hpp:31:63: error: template argument 1 is invalid
In file included from ./boost/fusion/container/vector/vector_iterator.hpp:17:0,
                 from ./boost/fusion/container/vector/detail/begin_impl.hpp:10,
                 from ./boost/fusion/container/vector/vector10.hpp:18,
                 from ./boost/fusion/container/vector/vector_fwd.hpp:14,
                 from ./boost/fusion/mpl/detail/clear.hpp:10,
                 from ./boost/fusion/mpl/clear.hpp:12,
                 from ./boost/fusion/mpl.hpp:17,
                 from ./boost/fusion/view/detail/strictest_traversal.hpp:15,
                 from ./boost/fusion/view/transform_view/transform_view.hpp:20,
                 from ./boost/fusion/view/transform_view.hpp:10,
                 from ./boost/fusion/include/transform_view.hpp:10,
                 from ./boost/proto/fusion.hpp:24,
                 from ./boost/proto/core.hpp:21,
                 from ./boost/xpressive/regex_primitives.hpp:28,
                 from ./boost/xpressive/xpressive_static.hpp:24,
                 from ./boost/graph/graphviz.hpp:31,
                 from ./boost/graph/graphml.hpp:20,
                 from libs/graph/src/graphml.cpp:17:
./boost/fusion/container/vector/detail/advance_impl.hpp:29:44: error: declaration does not declare anything [-fpermissive]
./boost/fusion/container/vector/detail/advance_impl.hpp:30:41: error: 'vector' was not declared in this scope
./boost/fusion/container/vector/detail/advance_impl.hpp:30:41: note: suggested alternatives:
/lpg-build/cdc/fast_prod/wrlinux501/dvd_install/lx34_12sp/wrlinux-5/layers/wr-toolchain/4.6a-99/bin/../lib/gcc/powerpc-wrs-linux-gnu/4.6.3/../../../../powerpc-wrs-linux-gnu/include/c++/4.6.3/bits/stl_vector.h:180:11: note:   'std::vector'
./boost/mpl/aux_/preprocessed/gcc/vector.hpp:22:8: note:   'boost::mpl::vector'
./boost/container/container_fwd.hpp:53:7: note:   'boost::container::vector'
/lpg-build/cdc/fast_prod/wrlinux501/dvd_install/lx34_12sp/wrlinux-5/layers/wr-toolchain/4.6a-99/bin/../lib/gcc/powerpc-wrs-linux-gnu/4.6.3/../../../../powerpc-wrs-linux-gnu/include/c++/4.6.3/bits/stl_vector.h:180:11: note:   'std::vector'
/lpg-build/cdc/fast_prod/wrlinux501/dvd_install/lx34_12sp/wrlinux-5/layers/wr-toolchain/4.6a-99/bin/../lib/gcc/powerpc-wrs-linux-gnu/4.6.3/../../../../powerpc-wrs-linux-gnu/include/c++/4.6.3/bits/stl_vector.h:180:11: note:   'std::vector'
/lpg-build/cdc/fast_prod/wrlinux501/dvd_install/lx34_12sp/wrlinux-5/layers/wr-toolchain/4.6a-99/bin/../lib/gcc/powerpc-wrs-linux-gnu/4.6.3/../../../../powerpc-wrs-linux-gnu/include/c++/4.6.3/bits/stl_vector.h:180:11: note:   'std::vector'
/lpg-build/cdc/fast_prod/wrlinux501/dvd_install/lx34_12sp/wrlinux-5/layers/wr-toolchain/4.6a-99/bin/../lib/gcc/powerpc-wrs-linux-gnu/4.6.3/../../../../powerpc-wrs-linux-gnu/include/c++/4.6.3/bits/stl_vector.h:180:11: note:   'std::vector'
./boost/fusion/container/vector/detail/advance_impl.hpp:30:70: error: template argument 1 is invalid

    "ppce6500-wrswrap-linux-gnu-g++" "-mcpu=e5500" "-mspe=no" "-mno-altivec" "-mcpu=e6500" "-maltivec" "-Wl,-O1" "-Wl,--hash-style=gnu" "--sysroot=/t4xxx_cgl/bitbake_build/tmp/sysroots/fsl-t4xxx"  -ftemplate-depth-128 -O3 -finline-functions -Wno-inline -Wall -pthread -fPIC  -DBOOST_ALL_NO_LIB=1 -DBOOST_GRAPH_DYN_LINK=1 -DNDEBUG  -I"." -I"libs/graph/src" -c -o "bin.v2/libs/graph/build/aca09349fdb84d131321425f6c3a38ed/graphml.o" "libs/graph/src/graphml.cpp"

...failed gcc.compile.c++ bin.v2/libs/graph/build/aca09349fdb84d131321425f6c3a38ed/graphml.o...
...skipped <pbin.v2/libs/graph/build/aca09349fdb84d131321425f6c3a38ed>libboost_graph.so.1.50.0 for lack of <pbin.v2/libs/graph/build/aca09349fdb84d131321425f6c3a38ed>read_graphviz_new.o...
...skipped <pstage/lib>libboost_graph.so.1.50.0 for lack of <pbin.v2/libs/graph/build/aca09349fdb84d131321425f6c3a38ed>libboost_graph.so.1.50.0...
...skipped <pstage/lib>libboost_graph.so for lack of <pstage/lib>libboost_graph.so.1.50.0...
common.mkdir bin.v2/libs/iostreams
common.mkdir bin.v2/libs/iostreams/build
common.mkdir bin.v2/libs/iostreams/build/aca09349fdb84d131321425f6c3a38ed
gcc.compile.c++ bin.v2/libs/iostreams/build/aca09349fdb84d131321425f6c3a38ed/file_descriptor.o
gcc.compile.c++ bin.v2/libs/iostreams/build/aca09349fdb84d131321425f6c3a38ed/mapped_file.o
gcc.link.dll bin.v2/libs/iostreams/build/aca09349fdb84d131321425f6c3a38ed/libboost_iostreams.so.1.50.0
common.copy stage/lib/libboost_iostreams.so.1.50.0
ln-UNIX stage/lib/libboost_iostreams.so
common.mkdir bin.v2/libs/program_options
common.mkdir bin.v2/libs/program_options/build
common.mkdir bin.v2/libs/program_options/build/aca09349fdb84d131321425f6c3a38ed
gcc.compile.c++ bin.v2/libs/program_options/build/aca09349fdb84d131321425f6c3a38ed/cmdline.o
gcc.compile.c++ bin.v2/libs/program_options/build/aca09349fdb84d131321425f6c3a38ed/config_file.o
gcc.compile.c++ bin.v2/libs/program_options/build/aca09349fdb84d131321425f6c3a38ed/options_description.o
gcc.compile.c++ bin.v2/libs/program_options/build/aca09349fdb84d131321425f6c3a38ed/parsers.o
gcc.compile.c++ bin.v2/libs/program_options/build/aca09349fdb84d131321425f6c3a38ed/variables_map.o
gcc.compile.c++ bin.v2/libs/program_options/build/aca09349fdb84d131321425f6c3a38ed/value_semantic.o
gcc.compile.c++ bin.v2/libs/program_options/build/aca09349fdb84d131321425f6c3a38ed/positional_options.o
gcc.compile.c++ bin.v2/libs/program_options/build/aca09349fdb84d131321425f6c3a38ed/utf8_codecvt_facet.o
gcc.compile.c++ bin.v2/libs/program_options/build/aca09349fdb84d131321425f6c3a38ed/convert.o
gcc.compile.c++ bin.v2/libs/program_options/build/aca09349fdb84d131321425f6c3a38ed/winmain.o
gcc.compile.c++ bin.v2/libs/program_options/build/aca09349fdb84d131321425f6c3a38ed/split.o
gcc.link.dll bin.v2/libs/program_options/build/aca09349fdb84d131321425f6c3a38ed/libboost_program_options.so.1.50.0
common.copy stage/lib/libboost_program_options.so.1.50.0
ln-UNIX stage/lib/libboost_program_options.so
common.mkdir bin.v2/libs/signals
common.mkdir bin.v2/libs/signals/build
common.mkdir bin.v2/libs/signals/build/aca09349fdb84d131321425f6c3a38ed
gcc.compile.c++ bin.v2/libs/signals/build/aca09349fdb84d131321425f6c3a38ed/trackable.o
gcc.compile.c++ bin.v2/libs/signals/build/aca09349fdb84d131321425f6c3a38ed/connection.o
gcc.compile.c++ bin.v2/libs/signals/build/aca09349fdb84d131321425f6c3a38ed/named_slot_map.o
gcc.compile.c++ bin.v2/libs/signals/build/aca09349fdb84d131321425f6c3a38ed/signal_base.o
gcc.compile.c++ bin.v2/libs/signals/build/aca09349fdb84d131321425f6c3a38ed/slot.o
gcc.link.dll bin.v2/libs/signals/build/aca09349fdb84d131321425f6c3a38ed/libboost_signals.so.1.50.0
common.copy stage/lib/libboost_signals.so.1.50.0
ln-UNIX stage/lib/libboost_signals.so
common.mkdir bin.v2/libs/test
common.mkdir bin.v2/libs/test/build
common.mkdir bin.v2/libs/test/build/aca09349fdb84d131321425f6c3a38ed
gcc.compile.c++ bin.v2/libs/test/build/aca09349fdb84d131321425f6c3a38ed/execution_monitor.o
gcc.compile.c++ bin.v2/libs/test/build/aca09349fdb84d131321425f6c3a38ed/debug.o
gcc.compile.c++ bin.v2/libs/test/build/aca09349fdb84d131321425f6c3a38ed/cpp_main.o
gcc.link.dll bin.v2/libs/test/build/aca09349fdb84d131321425f6c3a38ed/libboost_prg_exec_monitor.so.1.50.0
common.copy stage/lib/libboost_prg_exec_monitor.so.1.50.0
ln-UNIX stage/lib/libboost_prg_exec_monitor.so
common.mkdir bin.v2/libs/test/build/69ffc88faf507005827aa061bd65b9bd
gcc.compile.c++ bin.v2/libs/test/build/69ffc88faf507005827aa061bd65b9bd/compiler_log_formatter.o
gcc.compile.c++ bin.v2/libs/test/build/69ffc88faf507005827aa061bd65b9bd/debug.o
gcc.compile.c++ bin.v2/libs/test/build/69ffc88faf507005827aa061bd65b9bd/execution_monitor.o
gcc.compile.c++ bin.v2/libs/test/build/69ffc88faf507005827aa061bd65b9bd/framework.o
gcc.compile.c++ bin.v2/libs/test/build/69ffc88faf507005827aa061bd65b9bd/plain_report_formatter.o
gcc.compile.c++ bin.v2/libs/test/build/69ffc88faf507005827aa061bd65b9bd/progress_monitor.o
gcc.compile.c++ bin.v2/libs/test/build/69ffc88faf507005827aa061bd65b9bd/results_collector.o
gcc.compile.c++ bin.v2/libs/test/build/69ffc88faf507005827aa061bd65b9bd/results_reporter.o
gcc.compile.c++ bin.v2/libs/test/build/69ffc88faf507005827aa061bd65b9bd/test_main.o
gcc.compile.c++ bin.v2/libs/test/build/69ffc88faf507005827aa061bd65b9bd/test_tools.o
gcc.compile.c++ bin.v2/libs/test/build/69ffc88faf507005827aa061bd65b9bd/unit_test_log.o
gcc.compile.c++ bin.v2/libs/test/build/69ffc88faf507005827aa061bd65b9bd/unit_test_main.o
gcc.compile.c++ bin.v2/libs/test/build/69ffc88faf507005827aa061bd65b9bd/unit_test_monitor.o
gcc.compile.c++ bin.v2/libs/test/build/69ffc88faf507005827aa061bd65b9bd/unit_test_parameters.o
gcc.compile.c++ bin.v2/libs/test/build/69ffc88faf507005827aa061bd65b9bd/unit_test_suite.o
gcc.compile.c++ bin.v2/libs/test/build/69ffc88faf507005827aa061bd65b9bd/xml_log_formatter.o
gcc.compile.c++ bin.v2/libs/test/build/69ffc88faf507005827aa061bd65b9bd/xml_report_formatter.o
gcc.archive bin.v2/libs/test/build/69ffc88faf507005827aa061bd65b9bd/libboost_test_exec_monitor.a
common.copy stage/lib/libboost_test_exec_monitor.a
gcc.compile.c++ bin.v2/libs/test/build/aca09349fdb84d131321425f6c3a38ed/compiler_log_formatter.o
gcc.compile.c++ bin.v2/libs/test/build/aca09349fdb84d131321425f6c3a38ed/exception_safety.o
gcc.compile.c++ bin.v2/libs/test/build/aca09349fdb84d131321425f6c3a38ed/framework.o
gcc.compile.c++ bin.v2/libs/test/build/aca09349fdb84d131321425f6c3a38ed/interaction_based.o
gcc.compile.c++ bin.v2/libs/test/build/aca09349fdb84d131321425f6c3a38ed/logged_expectations.o
...on 100th target...
gcc.compile.c++ bin.v2/libs/test/build/aca09349fdb84d131321425f6c3a38ed/plain_report_formatter.o
gcc.compile.c++ bin.v2/libs/test/build/aca09349fdb84d131321425f6c3a38ed/progress_monitor.o
gcc.compile.c++ bin.v2/libs/test/build/aca09349fdb84d131321425f6c3a38ed/results_collector.o
gcc.compile.c++ bin.v2/libs/test/build/aca09349fdb84d131321425f6c3a38ed/results_reporter.o
gcc.compile.c++ bin.v2/libs/test/build/aca09349fdb84d131321425f6c3a38ed/test_tools.o
gcc.compile.c++ bin.v2/libs/test/build/aca09349fdb84d131321425f6c3a38ed/unit_test_log.o
gcc.compile.c++ bin.v2/libs/test/build/aca09349fdb84d131321425f6c3a38ed/unit_test_main.o
gcc.compile.c++ bin.v2/libs/test/build/aca09349fdb84d131321425f6c3a38ed/unit_test_monitor.o
gcc.compile.c++ bin.v2/libs/test/build/aca09349fdb84d131321425f6c3a38ed/unit_test_parameters.o
gcc.compile.c++ bin.v2/libs/test/build/aca09349fdb84d131321425f6c3a38ed/unit_test_suite.o
gcc.compile.c++ bin.v2/libs/test/build/aca09349fdb84d131321425f6c3a38ed/xml_log_formatter.o
gcc.compile.c++ bin.v2/libs/test/build/aca09349fdb84d131321425f6c3a38ed/xml_report_formatter.o
gcc.link.dll bin.v2/libs/test/build/aca09349fdb84d131321425f6c3a38ed/libboost_unit_test_framework.so.1.50.0
common.copy stage/lib/libboost_unit_test_framework.so.1.50.0
ln-UNIX stage/lib/libboost_unit_test_framework.so
common.mkdir bin.v2/libs/chrono
common.mkdir bin.v2/libs/chrono/build
common.mkdir bin.v2/libs/chrono/build/aca09349fdb84d131321425f6c3a38ed
gcc.compile.c++ bin.v2/libs/chrono/build/aca09349fdb84d131321425f6c3a38ed/chrono.o
gcc.compile.c++ bin.v2/libs/chrono/build/aca09349fdb84d131321425f6c3a38ed/thread_clock.o
gcc.compile.c++ bin.v2/libs/chrono/build/aca09349fdb84d131321425f6c3a38ed/process_cpu_clocks.o
common.mkdir bin.v2/libs/system
common.mkdir bin.v2/libs/system/build
common.mkdir bin.v2/libs/system/build/aca09349fdb84d131321425f6c3a38ed
gcc.compile.c++ bin.v2/libs/system/build/aca09349fdb84d131321425f6c3a38ed/error_code.o
gcc.link.dll bin.v2/libs/system/build/aca09349fdb84d131321425f6c3a38ed/libboost_system.so.1.50.0
gcc.link.dll bin.v2/libs/chrono/build/aca09349fdb84d131321425f6c3a38ed/libboost_chrono.so.1.50.0
common.copy stage/lib/libboost_chrono.so.1.50.0
ln-UNIX stage/lib/libboost_chrono.so
common.mkdir bin.v2/libs/thread
common.mkdir bin.v2/libs/thread/build
common.mkdir bin.v2/libs/thread/build/aca09349fdb84d131321425f6c3a38ed
common.mkdir bin.v2/libs/thread/build/aca09349fdb84d131321425f6c3a38ed/pthread
gcc.compile.c++ bin.v2/libs/thread/build/aca09349fdb84d131321425f6c3a38ed/pthread/thread.o
gcc.compile.c++ bin.v2/libs/thread/build/aca09349fdb84d131321425f6c3a38ed/pthread/once.o
gcc.compile.c++ bin.v2/libs/thread/build/aca09349fdb84d131321425f6c3a38ed/future.o
gcc.link.dll bin.v2/libs/thread/build/aca09349fdb84d131321425f6c3a38ed/libboost_thread.so.1.50.0
common.copy stage/lib/libboost_thread.so.1.50.0
ln-UNIX stage/lib/libboost_thread.so
common.mkdir bin.v2/libs/date_time
common.mkdir bin.v2/libs/date_time/build
common.mkdir bin.v2/libs/date_time/build/aca09349fdb84d131321425f6c3a38ed
common.mkdir bin.v2/libs/date_time/build/aca09349fdb84d131321425f6c3a38ed/gregorian
gcc.compile.c++ bin.v2/libs/date_time/build/aca09349fdb84d131321425f6c3a38ed/gregorian/greg_month.o
gcc.compile.c++ bin.v2/libs/date_time/build/aca09349fdb84d131321425f6c3a38ed/gregorian/greg_weekday.o
gcc.compile.c++ bin.v2/libs/date_time/build/aca09349fdb84d131321425f6c3a38ed/gregorian/date_generators.o
gcc.link.dll bin.v2/libs/date_time/build/aca09349fdb84d131321425f6c3a38ed/libboost_date_time.so.1.50.0
common.copy stage/lib/libboost_date_time.so.1.50.0
ln-UNIX stage/lib/libboost_date_time.so
common.copy stage/lib/libboost_system.so.1.50.0
ln-UNIX stage/lib/libboost_system.so
common.mkdir bin.v2/libs/filesystem
common.mkdir bin.v2/libs/filesystem/build
common.mkdir bin.v2/libs/filesystem/build/aca09349fdb84d131321425f6c3a38ed
gcc.compile.c++ bin.v2/libs/filesystem/build/aca09349fdb84d131321425f6c3a38ed/codecvt_error_category.o
gcc.compile.c++ bin.v2/libs/filesystem/build/aca09349fdb84d131321425f6c3a38ed/operations.o
gcc.compile.c++ bin.v2/libs/filesystem/build/aca09349fdb84d131321425f6c3a38ed/path.o
gcc.compile.c++ bin.v2/libs/filesystem/build/aca09349fdb84d131321425f6c3a38ed/path_traits.o
gcc.compile.c++ bin.v2/libs/filesystem/build/aca09349fdb84d131321425f6c3a38ed/portability.o
gcc.compile.c++ bin.v2/libs/filesystem/build/aca09349fdb84d131321425f6c3a38ed/unique_path.o
gcc.compile.c++ bin.v2/libs/filesystem/build/aca09349fdb84d131321425f6c3a38ed/utf8_codecvt_facet.o
gcc.compile.c++ bin.v2/libs/filesystem/build/aca09349fdb84d131321425f6c3a38ed/windows_file_codecvt.o
gcc.link.dll bin.v2/libs/filesystem/build/aca09349fdb84d131321425f6c3a38ed/libboost_filesystem.so.1.50.0
common.copy stage/lib/libboost_filesystem.so.1.50.0
ln-UNIX stage/lib/libboost_filesystem.so
common.mkdir bin.v2/libs/date_time/build/69ffc88faf507005827aa061bd65b9bd
common.mkdir bin.v2/libs/date_time/build/69ffc88faf507005827aa061bd65b9bd/gregorian
gcc.compile.c++ bin.v2/libs/date_time/build/69ffc88faf507005827aa061bd65b9bd/gregorian/greg_month.o
gcc.compile.c++ bin.v2/libs/date_time/build/69ffc88faf507005827aa061bd65b9bd/gregorian/greg_weekday.o
gcc.compile.c++ bin.v2/libs/date_time/build/69ffc88faf507005827aa061bd65b9bd/gregorian/date_generators.o
gcc.archive bin.v2/libs/date_time/build/69ffc88faf507005827aa061bd65b9bd/libboost_date_time.a
common.copy stage/lib/libboost_date_time.a
common.mkdir bin.v2/libs/system/build/69ffc88faf507005827aa061bd65b9bd
gcc.compile.c++ bin.v2/libs/system/build/69ffc88faf507005827aa061bd65b9bd/error_code.o
gcc.archive bin.v2/libs/system/build/69ffc88faf507005827aa061bd65b9bd/libboost_system.a
common.copy stage/lib/libboost_system.a
common.mkdir bin.v2/libs/filesystem/build/69ffc88faf507005827aa061bd65b9bd
gcc.compile.c++ bin.v2/libs/filesystem/build/69ffc88faf507005827aa061bd65b9bd/codecvt_error_category.o
gcc.compile.c++ bin.v2/libs/filesystem/build/69ffc88faf507005827aa061bd65b9bd/operations.o
gcc.compile.c++ bin.v2/libs/filesystem/build/69ffc88faf507005827aa061bd65b9bd/path.o
gcc.compile.c++ bin.v2/libs/filesystem/build/69ffc88faf507005827aa061bd65b9bd/path_traits.o
gcc.compile.c++ bin.v2/libs/filesystem/build/69ffc88faf507005827aa061bd65b9bd/portability.o
gcc.compile.c++ bin.v2/libs/filesystem/build/69ffc88faf507005827aa061bd65b9bd/unique_path.o
gcc.compile.c++ bin.v2/libs/filesystem/build/69ffc88faf507005827aa061bd65b9bd/utf8_codecvt_facet.o
gcc.compile.c++ bin.v2/libs/filesystem/build/69ffc88faf507005827aa061bd65b9bd/windows_file_codecvt.o
gcc.archive bin.v2/libs/filesystem/build/69ffc88faf507005827aa061bd65b9bd/libboost_filesystem.a
common.copy stage/lib/libboost_filesystem.a
common.mkdir bin.v2/libs/regex/build/69ffc88faf507005827aa061bd65b9bd
gcc.compile.c++ bin.v2/libs/regex/build/69ffc88faf507005827aa061bd65b9bd/c_regex_traits.o
gcc.compile.c++ bin.v2/libs/regex/build/69ffc88faf507005827aa061bd65b9bd/cpp_regex_traits.o
gcc.compile.c++ bin.v2/libs/regex/build/69ffc88faf507005827aa061bd65b9bd/cregex.o
gcc.compile.c++ bin.v2/libs/regex/build/69ffc88faf507005827aa061bd65b9bd/fileiter.o
gcc.compile.c++ bin.v2/libs/regex/build/69ffc88faf507005827aa061bd65b9bd/icu.o
gcc.compile.c++ bin.v2/libs/regex/build/69ffc88faf507005827aa061bd65b9bd/instances.o
gcc.compile.c++ bin.v2/libs/regex/build/69ffc88faf507005827aa061bd65b9bd/posix_api.o
gcc.compile.c++ bin.v2/libs/regex/build/69ffc88faf507005827aa061bd65b9bd/regex.o
gcc.compile.c++ bin.v2/libs/regex/build/69ffc88faf507005827aa061bd65b9bd/regex_debug.o
...on 200th target...
gcc.compile.c++ bin.v2/libs/regex/build/69ffc88faf507005827aa061bd65b9bd/regex_raw_buffer.o
gcc.compile.c++ bin.v2/libs/regex/build/69ffc88faf507005827aa061bd65b9bd/regex_traits_defaults.o
gcc.compile.c++ bin.v2/libs/regex/build/69ffc88faf507005827aa061bd65b9bd/static_mutex.o
gcc.compile.c++ bin.v2/libs/regex/build/69ffc88faf507005827aa061bd65b9bd/w32_regex_traits.o
gcc.compile.c++ bin.v2/libs/regex/build/69ffc88faf507005827aa061bd65b9bd/wc_regex_traits.o
gcc.compile.c++ bin.v2/libs/regex/build/69ffc88faf507005827aa061bd65b9bd/wide_posix_api.o
gcc.compile.c++ bin.v2/libs/regex/build/69ffc88faf507005827aa061bd65b9bd/winstances.o
gcc.compile.c++ bin.v2/libs/regex/build/69ffc88faf507005827aa061bd65b9bd/usinstances.o
gcc.archive bin.v2/libs/regex/build/69ffc88faf507005827aa061bd65b9bd/libboost_regex.a
common.copy stage/lib/libboost_regex.a
common.mkdir bin.v2/libs/graph/build/69ffc88faf507005827aa061bd65b9bd
gcc.compile.c++ bin.v2/libs/graph/build/69ffc88faf507005827aa061bd65b9bd/read_graphviz_new.o
In file included from ./boost/fusion/container/vector/vector_iterator.hpp:11:0,
                 from ./boost/fusion/container/vector/detail/begin_impl.hpp:10,
                 from ./boost/fusion/container/vector/vector10.hpp:18,
                 from ./boost/fusion/container/vector/vector_fwd.hpp:14,
                 from ./boost/fusion/mpl/detail/clear.hpp:10,
                 from ./boost/fusion/mpl/clear.hpp:12,
                 from ./boost/fusion/mpl.hpp:17,
                 from ./boost/fusion/view/detail/strictest_traversal.hpp:15,
                 from ./boost/fusion/view/transform_view/transform_view.hpp:20,
                 from ./boost/fusion/view/transform_view.hpp:10,
                 from ./boost/fusion/include/transform_view.hpp:10,
                 from ./boost/proto/fusion.hpp:24,
                 from ./boost/proto/core.hpp:21,
                 from ./boost/xpressive/regex_primitives.hpp:28,
                 from ./boost/xpressive/xpressive_static.hpp:24,
                 from ./boost/graph/graphviz.hpp:31,
                 from libs/graph/src/read_graphviz_new.cpp:50:
./boost/fusion/container/vector/detail/deref_impl.hpp:30:44: error: declaration does not declare anything [-fpermissive]
./boost/fusion/container/vector/detail/deref_impl.hpp:33:50: error: template argument 1 is invalid
./boost/fusion/container/vector/detail/deref_impl.hpp:33:51: error: expected identifier before '::' token
./boost/fusion/container/vector/detail/deref_impl.hpp:33:53: error: typedef name may not be a nested-name-specifier
./boost/fusion/container/vector/detail/deref_impl.hpp:33:53: error: expected ';' at end of member declaration
./boost/fusion/container/vector/detail/deref_impl.hpp:34:17: error: 'element' does not name a type
./boost/fusion/container/vector/detail/deref_impl.hpp:38:34: error: 'vector' was not declared in this scope
./boost/fusion/container/vector/detail/deref_impl.hpp:38:34: note: suggested alternatives:
/lpg-build/cdc/fast_prod/wrlinux501/dvd_install/lx34_12sp/wrlinux-5/layers/wr-toolchain/4.6a-99/bin/../lib/gcc/powerpc-wrs-linux-gnu/4.6.3/../../../../powerpc-wrs-linux-gnu/include/c++/4.6.3/bits/stl_vector.h:180:11: note:   'std::vector'
./boost/mpl/aux_/preprocessed/gcc/vector.hpp:22:8: note:   'boost::mpl::vector'
./boost/container/container_fwd.hpp:53:7: note:   'boost::container::vector'
/lpg-build/cdc/fast_prod/wrlinux501/dvd_install/lx34_12sp/wrlinux-5/layers/wr-toolchain/4.6a-99/bin/../lib/gcc/powerpc-wrs-linux-gnu/4.6.3/../../../../powerpc-wrs-linux-gnu/include/c++/4.6.3/bits/stl_vector.h:180:11: note:   'std::vector'
/lpg-build/cdc/fast_prod/wrlinux501/dvd_install/lx34_12sp/wrlinux-5/layers/wr-toolchain/4.6a-99/bin/../lib/gcc/powerpc-wrs-linux-gnu/4.6.3/../../../../powerpc-wrs-linux-gnu/include/c++/4.6.3/bits/stl_vector.h:180:11: note:   'std::vector'
/lpg-build/cdc/fast_prod/wrlinux501/dvd_install/lx34_12sp/wrlinux-5/layers/wr-toolchain/4.6a-99/bin/../lib/gcc/powerpc-wrs-linux-gnu/4.6.3/../../../../powerpc-wrs-linux-gnu/include/c++/4.6.3/bits/stl_vector.h:180:11: note:   'std::vector'
/lpg-build/cdc/fast_prod/wrlinux501/dvd_install/lx34_12sp/wrlinux-5/layers/wr-toolchain/4.6a-99/bin/../lib/gcc/powerpc-wrs-linux-gnu/4.6.3/../../../../powerpc-wrs-linux-gnu/include/c++/4.6.3/bits/stl_vector.h:180:11: note:   'std::vector'
./boost/fusion/container/vector/detail/deref_impl.hpp:38:40: error: template argument 1 is invalid
./boost/fusion/container/vector/detail/deref_impl.hpp:39:62: error: 'element' was not declared in this scope
./boost/fusion/container/vector/detail/deref_impl.hpp:39:62: note: suggested alternative:
./boost/tuple/detail/tuple_basic.hpp:125:8: note:   'boost::tuples::element'
./boost/fusion/container/vector/detail/deref_impl.hpp:39:69: error: template argument 1 is invalid
./boost/fusion/container/vector/detail/deref_impl.hpp:40:61: error: 'element' was not declared in this scope
./boost/fusion/container/vector/detail/deref_impl.hpp:40:61: note: suggested alternative:
./boost/tuple/detail/tuple_basic.hpp:125:8: note:   'boost::tuples::element'
./boost/fusion/container/vector/detail/deref_impl.hpp:40:68: error: template argument 1 is invalid
./boost/fusion/container/vector/detail/deref_impl.hpp:41:21: error: template argument 1 is invalid
./boost/fusion/container/vector/detail/deref_impl.hpp:41:21: error: template argument 2 is invalid
./boost/fusion/container/vector/detail/deref_impl.hpp:41:21: error: template argument 3 is invalid
In file included from ./boost/fusion/container/vector/vector_iterator.hpp:12:0,
                 from ./boost/fusion/container/vector/detail/begin_impl.hpp:10,
                 from ./boost/fusion/container/vector/vector10.hpp:18,
                 from ./boost/fusion/container/vector/vector_fwd.hpp:14,
                 from ./boost/fusion/mpl/detail/clear.hpp:10,
                 from ./boost/fusion/mpl/clear.hpp:12,
                 from ./boost/fusion/mpl.hpp:17,
                 from ./boost/fusion/view/detail/strictest_traversal.hpp:15,
                 from ./boost/fusion/view/transform_view/transform_view.hpp:20,
                 from ./boost/fusion/view/transform_view.hpp:10,
                 from ./boost/fusion/include/transform_view.hpp:10,
                 from ./boost/proto/fusion.hpp:24,
                 from ./boost/proto/core.hpp:21,
                 from ./boost/xpressive/regex_primitives.hpp:28,
                 from ./boost/xpressive/xpressive_static.hpp:24,
                 from ./boost/graph/graphviz.hpp:31,
                 from libs/graph/src/read_graphviz_new.cpp:50:
./boost/fusion/container/vector/detail/value_of_impl.hpp:27:44: error: declaration does not declare anything [-fpermissive]
./boost/fusion/container/vector/detail/value_of_impl.hpp:30:50: error: template argument 1 is invalid
./boost/fusion/container/vector/detail/value_of_impl.hpp:30:51: error: expected identifier before '::' token
./boost/fusion/container/vector/detail/value_of_impl.hpp:30:53: error: typedef name may not be a nested-name-specifier
./boost/fusion/container/vector/detail/value_of_impl.hpp:30:53: error: expected ';' at end of member declaration
./boost/fusion/container/vector/detail/value_of_impl.hpp:31:17: error: invalid use of template-name 'boost::type' without an argument list
In file included from ./boost/fusion/container/vector/vector_iterator.hpp:13:0,
                 from ./boost/fusion/container/vector/detail/begin_impl.hpp:10,
                 from ./boost/fusion/container/vector/vector10.hpp:18,
                 from ./boost/fusion/container/vector/vector_fwd.hpp:14,
                 from ./boost/fusion/mpl/detail/clear.hpp:10,
                 from ./boost/fusion/mpl/clear.hpp:12,
                 from ./boost/fusion/mpl.hpp:17,
                 from ./boost/fusion/view/detail/strictest_traversal.hpp:15,
                 from ./boost/fusion/view/transform_view/transform_view.hpp:20,
                 from ./boost/fusion/view/transform_view.hpp:10,
                 from ./boost/fusion/include/transform_view.hpp:10,
                 from ./boost/proto/fusion.hpp:24,
                 from ./boost/proto/core.hpp:21,
                 from ./boost/xpressive/regex_primitives.hpp:28,
                 from ./boost/xpressive/xpressive_static.hpp:24,
                 from ./boost/graph/graphviz.hpp:31,
                 from libs/graph/src/read_graphviz_new.cpp:50:
./boost/fusion/container/vector/detail/next_impl.hpp:29:44: error: declaration does not declare anything [-fpermissive]
./boost/fusion/container/vector/detail/next_impl.hpp:31:41: error: 'vector' was not declared in this scope
./boost/fusion/container/vector/detail/next_impl.hpp:31:41: note: suggested alternatives:
/lpg-build/cdc/fast_prod/wrlinux501/dvd_install/lx34_12sp/wrlinux-5/layers/wr-toolchain/4.6a-99/bin/../lib/gcc/powerpc-wrs-linux-gnu/4.6.3/../../../../powerpc-wrs-linux-gnu/include/c++/4.6.3/bits/stl_vector.h:180:11: note:   'std::vector'
./boost/mpl/aux_/preprocessed/gcc/vector.hpp:22:8: note:   'boost::mpl::vector'
./boost/container/container_fwd.hpp:53:7: note:   'boost::container::vector'
/lpg-build/cdc/fast_prod/wrlinux501/dvd_install/lx34_12sp/wrlinux-5/layers/wr-toolchain/4.6a-99/bin/../lib/gcc/powerpc-wrs-linux-gnu/4.6.3/../../../../powerpc-wrs-linux-gnu/include/c++/4.6.3/bits/stl_vector.h:180:11: note:   'std::vector'
/lpg-build/cdc/fast_prod/wrlinux501/dvd_install/lx34_12sp/wrlinux-5/layers/wr-toolchain/4.6a-99/bin/../lib/gcc/powerpc-wrs-linux-gnu/4.6.3/../../../../powerpc-wrs-linux-gnu/include/c++/4.6.3/bits/stl_vector.h:180:11: note:   'std::vector'
/lpg-build/cdc/fast_prod/wrlinux501/dvd_install/lx34_12sp/wrlinux-5/layers/wr-toolchain/4.6a-99/bin/../lib/gcc/powerpc-wrs-linux-gnu/4.6.3/../../../../powerpc-wrs-linux-gnu/include/c++/4.6.3/bits/stl_vector.h:180:11: note:   'std::vector'
/lpg-build/cdc/fast_prod/wrlinux501/dvd_install/lx34_12sp/wrlinux-5/layers/wr-toolchain/4.6a-99/bin/../lib/gcc/powerpc-wrs-linux-gnu/4.6.3/../../../../powerpc-wrs-linux-gnu/include/c++/4.6.3/bits/stl_vector.h:180:11: note:   'std::vector'
./boost/fusion/container/vector/detail/next_impl.hpp:31:63: error: template argument 1 is invalid
In file included from ./boost/fusion/container/vector/vector_iterator.hpp:14:0,
                 from ./boost/fusion/container/vector/detail/begin_impl.hpp:10,
                 from ./boost/fusion/container/vector/vector10.hpp:18,
                 from ./boost/fusion/container/vector/vector_fwd.hpp:14,
                 from ./boost/fusion/mpl/detail/clear.hpp:10,
                 from ./boost/fusion/mpl/clear.hpp:12,
                 from ./boost/fusion/mpl.hpp:17,
                 from ./boost/fusion/view/detail/strictest_traversal.hpp:15,
                 from ./boost/fusion/view/transform_view/transform_view.hpp:20,
                 from ./boost/fusion/view/transform_view.hpp:10,
                 from ./boost/fusion/include/transform_view.hpp:10,
                 from ./boost/proto/fusion.hpp:24,
                 from ./boost/proto/core.hpp:21,
                 from ./boost/xpressive/regex_primitives.hpp:28,
                 from ./boost/xpressive/xpressive_static.hpp:24,
                 from ./boost/graph/graphviz.hpp:31,
                 from libs/graph/src/read_graphviz_new.cpp:50:
./boost/fusion/container/vector/detail/prior_impl.hpp:29:44: error: declaration does not declare anything [-fpermissive]
./boost/fusion/container/vector/detail/prior_impl.hpp:31:41: error: 'vector' was not declared in this scope
./boost/fusion/container/vector/detail/prior_impl.hpp:31:41: note: suggested alternatives:
/lpg-build/cdc/fast_prod/wrlinux501/dvd_install/lx34_12sp/wrlinux-5/layers/wr-toolchain/4.6a-99/bin/../lib/gcc/powerpc-wrs-linux-gnu/4.6.3/../../../../powerpc-wrs-linux-gnu/include/c++/4.6.3/bits/stl_vector.h:180:11: note:   'std::vector'
./boost/mpl/aux_/preprocessed/gcc/vector.hpp:22:8: note:   'boost::mpl::vector'
./boost/container/container_fwd.hpp:53:7: note:   'boost::container::vector'
/lpg-build/cdc/fast_prod/wrlinux501/dvd_install/lx34_12sp/wrlinux-5/layers/wr-toolchain/4.6a-99/bin/../lib/gcc/powerpc-wrs-linux-gnu/4.6.3/../../../../powerpc-wrs-linux-gnu/include/c++/4.6.3/bits/stl_vector.h:180:11: note:   'std::vector'
/lpg-build/cdc/fast_prod/wrlinux501/dvd_install/lx34_12sp/wrlinux-5/layers/wr-toolchain/4.6a-99/bin/../lib/gcc/powerpc-wrs-linux-gnu/4.6.3/../../../../powerpc-wrs-linux-gnu/include/c++/4.6.3/bits/stl_vector.h:180:11: note:   'std::vector'
/lpg-build/cdc/fast_prod/wrlinux501/dvd_install/lx34_12sp/wrlinux-5/layers/wr-toolchain/4.6a-99/bin/../lib/gcc/powerpc-wrs-linux-gnu/4.6.3/../../../../powerpc-wrs-linux-gnu/include/c++/4.6.3/bits/stl_vector.h:180:11: note:   'std::vector'
/lpg-build/cdc/fast_prod/wrlinux501/dvd_install/lx34_12sp/wrlinux-5/layers/wr-toolchain/4.6a-99/bin/../lib/gcc/powerpc-wrs-linux-gnu/4.6.3/../../../../powerpc-wrs-linux-gnu/include/c++/4.6.3/bits/stl_vector.h:180:11: note:   'std::vector'
./boost/fusion/container/vector/detail/prior_impl.hpp:31:63: error: template argument 1 is invalid
In file included from ./boost/fusion/container/vector/vector_iterator.hpp:17:0,
                 from ./boost/fusion/container/vector/detail/begin_impl.hpp:10,
                 from ./boost/fusion/container/vector/vector10.hpp:18,
                 from ./boost/fusion/container/vector/vector_fwd.hpp:14,
                 from ./boost/fusion/mpl/detail/clear.hpp:10,
                 from ./boost/fusion/mpl/clear.hpp:12,
                 from ./boost/fusion/mpl.hpp:17,
                 from ./boost/fusion/view/detail/strictest_traversal.hpp:15,
                 from ./boost/fusion/view/transform_view/transform_view.hpp:20,
                 from ./boost/fusion/view/transform_view.hpp:10,
                 from ./boost/fusion/include/transform_view.hpp:10,
                 from ./boost/proto/fusion.hpp:24,
                 from ./boost/proto/core.hpp:21,
                 from ./boost/xpressive/regex_primitives.hpp:28,
                 from ./boost/xpressive/xpressive_static.hpp:24,
                 from ./boost/graph/graphviz.hpp:31,
                 from libs/graph/src/read_graphviz_new.cpp:50:
./boost/fusion/container/vector/detail/advance_impl.hpp:29:44: error: declaration does not declare anything [-fpermissive]
./boost/fusion/container/vector/detail/advance_impl.hpp:30:41: error: 'vector' was not declared in this scope
./boost/fusion/container/vector/detail/advance_impl.hpp:30:41: note: suggested alternatives:
/lpg-build/cdc/fast_prod/wrlinux501/dvd_install/lx34_12sp/wrlinux-5/layers/wr-toolchain/4.6a-99/bin/../lib/gcc/powerpc-wrs-linux-gnu/4.6.3/../../../../powerpc-wrs-linux-gnu/include/c++/4.6.3/bits/stl_vector.h:180:11: note:   'std::vector'
./boost/mpl/aux_/preprocessed/gcc/vector.hpp:22:8: note:   'boost::mpl::vector'
./boost/container/container_fwd.hpp:53:7: note:   'boost::container::vector'
/lpg-build/cdc/fast_prod/wrlinux501/dvd_install/lx34_12sp/wrlinux-5/layers/wr-toolchain/4.6a-99/bin/../lib/gcc/powerpc-wrs-linux-gnu/4.6.3/../../../../powerpc-wrs-linux-gnu/include/c++/4.6.3/bits/stl_vector.h:180:11: note:   'std::vector'
/lpg-build/cdc/fast_prod/wrlinux501/dvd_install/lx34_12sp/wrlinux-5/layers/wr-toolchain/4.6a-99/bin/../lib/gcc/powerpc-wrs-linux-gnu/4.6.3/../../../../powerpc-wrs-linux-gnu/include/c++/4.6.3/bits/stl_vector.h:180:11: note:   'std::vector'
/lpg-build/cdc/fast_prod/wrlinux501/dvd_install/lx34_12sp/wrlinux-5/layers/wr-toolchain/4.6a-99/bin/../lib/gcc/powerpc-wrs-linux-gnu/4.6.3/../../../../powerpc-wrs-linux-gnu/include/c++/4.6.3/bits/stl_vector.h:180:11: note:   'std::vector'
/lpg-build/cdc/fast_prod/wrlinux501/dvd_install/lx34_12sp/wrlinux-5/layers/wr-toolchain/4.6a-99/bin/../lib/gcc/powerpc-wrs-linux-gnu/4.6.3/../../../../powerpc-wrs-linux-gnu/include/c++/4.6.3/bits/stl_vector.h:180:11: note:   'std::vector'
./boost/fusion/container/vector/detail/advance_impl.hpp:30:70: error: template argument 1 is invalid

    "ppce6500-wrswrap-linux-gnu-g++" "-mcpu=e5500" "-mspe=no" "-mno-altivec" "-mcpu=e6500" "-maltivec" "-Wl,-O1" "-Wl,--hash-style=gnu" "--sysroot=/t4xxx_cgl/bitbake_build/tmp/sysroots/fsl-t4xxx"  -ftemplate-depth-128 -O3 -finline-functions -Wno-inline -Wall -pthread  -DBOOST_ALL_NO_LIB=1 -DNDEBUG  -I"." -I"libs/graph/src" -c -o "bin.v2/libs/graph/build/69ffc88faf507005827aa061bd65b9bd/read_graphviz_new.o" "libs/graph/src/read_graphviz_new.cpp"

...failed gcc.compile.c++ bin.v2/libs/graph/build/69ffc88faf507005827aa061bd65b9bd/read_graphviz_new.o...
gcc.compile.c++ bin.v2/libs/graph/build/69ffc88faf507005827aa061bd65b9bd/graphml.o
In file included from ./boost/fusion/container/vector/vector_iterator.hpp:11:0,
                 from ./boost/fusion/container/vector/detail/begin_impl.hpp:10,
                 from ./boost/fusion/container/vector/vector10.hpp:18,
                 from ./boost/fusion/container/vector/vector_fwd.hpp:14,
                 from ./boost/fusion/mpl/detail/clear.hpp:10,
                 from ./boost/fusion/mpl/clear.hpp:12,
                 from ./boost/fusion/mpl.hpp:17,
                 from ./boost/fusion/view/detail/strictest_traversal.hpp:15,
                 from ./boost/fusion/view/transform_view/transform_view.hpp:20,
                 from ./boost/fusion/view/transform_view.hpp:10,
                 from ./boost/fusion/include/transform_view.hpp:10,
                 from ./boost/proto/fusion.hpp:24,
                 from ./boost/proto/core.hpp:21,
                 from ./boost/xpressive/regex_primitives.hpp:28,
                 from ./boost/xpressive/xpressive_static.hpp:24,
                 from ./boost/graph/graphviz.hpp:31,
                 from ./boost/graph/graphml.hpp:20,
                 from libs/graph/src/graphml.cpp:17:
./boost/fusion/container/vector/detail/deref_impl.hpp:30:44: error: declaration does not declare anything [-fpermissive]
./boost/fusion/container/vector/detail/deref_impl.hpp:33:50: error: template argument 1 is invalid
./boost/fusion/container/vector/detail/deref_impl.hpp:33:51: error: expected identifier before '::' token
./boost/fusion/container/vector/detail/deref_impl.hpp:33:53: error: typedef name may not be a nested-name-specifier
./boost/fusion/container/vector/detail/deref_impl.hpp:33:53: error: expected ';' at end of member declaration
./boost/fusion/container/vector/detail/deref_impl.hpp:34:17: error: 'element' does not name a type
./boost/fusion/container/vector/detail/deref_impl.hpp:38:34: error: 'vector' was not declared in this scope
./boost/fusion/container/vector/detail/deref_impl.hpp:38:34: note: suggested alternatives:
/lpg-build/cdc/fast_prod/wrlinux501/dvd_install/lx34_12sp/wrlinux-5/layers/wr-toolchain/4.6a-99/bin/../lib/gcc/powerpc-wrs-linux-gnu/4.6.3/../../../../powerpc-wrs-linux-gnu/include/c++/4.6.3/bits/stl_vector.h:180:11: note:   'std::vector'
./boost/mpl/aux_/preprocessed/gcc/vector.hpp:22:8: note:   'boost::mpl::vector'
./boost/container/container_fwd.hpp:53:7: note:   'boost::container::vector'
/lpg-build/cdc/fast_prod/wrlinux501/dvd_install/lx34_12sp/wrlinux-5/layers/wr-toolchain/4.6a-99/bin/../lib/gcc/powerpc-wrs-linux-gnu/4.6.3/../../../../powerpc-wrs-linux-gnu/include/c++/4.6.3/bits/stl_vector.h:180:11: note:   'std::vector'
/lpg-build/cdc/fast_prod/wrlinux501/dvd_install/lx34_12sp/wrlinux-5/layers/wr-toolchain/4.6a-99/bin/../lib/gcc/powerpc-wrs-linux-gnu/4.6.3/../../../../powerpc-wrs-linux-gnu/include/c++/4.6.3/bits/stl_vector.h:180:11: note:   'std::vector'
/lpg-build/cdc/fast_prod/wrlinux501/dvd_install/lx34_12sp/wrlinux-5/layers/wr-toolchain/4.6a-99/bin/../lib/gcc/powerpc-wrs-linux-gnu/4.6.3/../../../../powerpc-wrs-linux-gnu/include/c++/4.6.3/bits/stl_vector.h:180:11: note:   'std::vector'
/lpg-build/cdc/fast_prod/wrlinux501/dvd_install/lx34_12sp/wrlinux-5/layers/wr-toolchain/4.6a-99/bin/../lib/gcc/powerpc-wrs-linux-gnu/4.6.3/../../../../powerpc-wrs-linux-gnu/include/c++/4.6.3/bits/stl_vector.h:180:11: note:   'std::vector'
./boost/fusion/container/vector/detail/deref_impl.hpp:38:40: error: template argument 1 is invalid
./boost/fusion/container/vector/detail/deref_impl.hpp:39:62: error: 'element' was not declared in this scope
./boost/fusion/container/vector/detail/deref_impl.hpp:39:62: note: suggested alternative:
./boost/tuple/detail/tuple_basic.hpp:125:8: note:   'boost::tuples::element'
./boost/fusion/container/vector/detail/deref_impl.hpp:39:69: error: template argument 1 is invalid
./boost/fusion/container/vector/detail/deref_impl.hpp:40:61: error: 'element' was not declared in this scope
./boost/fusion/container/vector/detail/deref_impl.hpp:40:61: note: suggested alternative:
./boost/tuple/detail/tuple_basic.hpp:125:8: note:   'boost::tuples::element'
./boost/fusion/container/vector/detail/deref_impl.hpp:40:68: error: template argument 1 is invalid
./boost/fusion/container/vector/detail/deref_impl.hpp:41:21: error: template argument 1 is invalid
./boost/fusion/container/vector/detail/deref_impl.hpp:41:21: error: template argument 2 is invalid
./boost/fusion/container/vector/detail/deref_impl.hpp:41:21: error: template argument 3 is invalid
In file included from ./boost/fusion/container/vector/vector_iterator.hpp:12:0,
                 from ./boost/fusion/container/vector/detail/begin_impl.hpp:10,
                 from ./boost/fusion/container/vector/vector10.hpp:18,
                 from ./boost/fusion/container/vector/vector_fwd.hpp:14,
                 from ./boost/fusion/mpl/detail/clear.hpp:10,
                 from ./boost/fusion/mpl/clear.hpp:12,
                 from ./boost/fusion/mpl.hpp:17,
                 from ./boost/fusion/view/detail/strictest_traversal.hpp:15,
                 from ./boost/fusion/view/transform_view/transform_view.hpp:20,
                 from ./boost/fusion/view/transform_view.hpp:10,
                 from ./boost/fusion/include/transform_view.hpp:10,
                 from ./boost/proto/fusion.hpp:24,
                 from ./boost/proto/core.hpp:21,
                 from ./boost/xpressive/regex_primitives.hpp:28,
                 from ./boost/xpressive/xpressive_static.hpp:24,
                 from ./boost/graph/graphviz.hpp:31,
                 from ./boost/graph/graphml.hpp:20,
                 from libs/graph/src/graphml.cpp:17:
./boost/fusion/container/vector/detail/value_of_impl.hpp:27:44: error: declaration does not declare anything [-fpermissive]
./boost/fusion/container/vector/detail/value_of_impl.hpp:30:50: error: template argument 1 is invalid
./boost/fusion/container/vector/detail/value_of_impl.hpp:30:51: error: expected identifier before '::' token
./boost/fusion/container/vector/detail/value_of_impl.hpp:30:53: error: typedef name may not be a nested-name-specifier
./boost/fusion/container/vector/detail/value_of_impl.hpp:30:53: error: expected ';' at end of member declaration
./boost/fusion/container/vector/detail/value_of_impl.hpp:31:17: error: invalid use of template-name 'boost::type' without an argument list
In file included from ./boost/fusion/container/vector/vector_iterator.hpp:13:0,
                 from ./boost/fusion/container/vector/detail/begin_impl.hpp:10,
                 from ./boost/fusion/container/vector/vector10.hpp:18,
                 from ./boost/fusion/container/vector/vector_fwd.hpp:14,
                 from ./boost/fusion/mpl/detail/clear.hpp:10,
                 from ./boost/fusion/mpl/clear.hpp:12,
                 from ./boost/fusion/mpl.hpp:17,
                 from ./boost/fusion/view/detail/strictest_traversal.hpp:15,
                 from ./boost/fusion/view/transform_view/transform_view.hpp:20,
                 from ./boost/fusion/view/transform_view.hpp:10,
                 from ./boost/fusion/include/transform_view.hpp:10,
                 from ./boost/proto/fusion.hpp:24,
                 from ./boost/proto/core.hpp:21,
                 from ./boost/xpressive/regex_primitives.hpp:28,
                 from ./boost/xpressive/xpressive_static.hpp:24,
                 from ./boost/graph/graphviz.hpp:31,
                 from ./boost/graph/graphml.hpp:20,
                 from libs/graph/src/graphml.cpp:17:
./boost/fusion/container/vector/detail/next_impl.hpp:29:44: error: declaration does not declare anything [-fpermissive]
./boost/fusion/container/vector/detail/next_impl.hpp:31:41: error: 'vector' was not declared in this scope
./boost/fusion/container/vector/detail/next_impl.hpp:31:41: note: suggested alternatives:
/lpg-build/cdc/fast_prod/wrlinux501/dvd_install/lx34_12sp/wrlinux-5/layers/wr-toolchain/4.6a-99/bin/../lib/gcc/powerpc-wrs-linux-gnu/4.6.3/../../../../powerpc-wrs-linux-gnu/include/c++/4.6.3/bits/stl_vector.h:180:11: note:   'std::vector'
./boost/mpl/aux_/preprocessed/gcc/vector.hpp:22:8: note:   'boost::mpl::vector'
./boost/container/container_fwd.hpp:53:7: note:   'boost::container::vector'
/lpg-build/cdc/fast_prod/wrlinux501/dvd_install/lx34_12sp/wrlinux-5/layers/wr-toolchain/4.6a-99/bin/../lib/gcc/powerpc-wrs-linux-gnu/4.6.3/../../../../powerpc-wrs-linux-gnu/include/c++/4.6.3/bits/stl_vector.h:180:11: note:   'std::vector'
/lpg-build/cdc/fast_prod/wrlinux501/dvd_install/lx34_12sp/wrlinux-5/layers/wr-toolchain/4.6a-99/bin/../lib/gcc/powerpc-wrs-linux-gnu/4.6.3/../../../../powerpc-wrs-linux-gnu/include/c++/4.6.3/bits/stl_vector.h:180:11: note:   'std::vector'
/lpg-build/cdc/fast_prod/wrlinux501/dvd_install/lx34_12sp/wrlinux-5/layers/wr-toolchain/4.6a-99/bin/../lib/gcc/powerpc-wrs-linux-gnu/4.6.3/../../../../powerpc-wrs-linux-gnu/include/c++/4.6.3/bits/stl_vector.h:180:11: note:   'std::vector'
/lpg-build/cdc/fast_prod/wrlinux501/dvd_install/lx34_12sp/wrlinux-5/layers/wr-toolchain/4.6a-99/bin/../lib/gcc/powerpc-wrs-linux-gnu/4.6.3/../../../../powerpc-wrs-linux-gnu/include/c++/4.6.3/bits/stl_vector.h:180:11: note:   'std::vector'
./boost/fusion/container/vector/detail/next_impl.hpp:31:63: error: template argument 1 is invalid
In file included from ./boost/fusion/container/vector/vector_iterator.hpp:14:0,
                 from ./boost/fusion/container/vector/detail/begin_impl.hpp:10,
                 from ./boost/fusion/container/vector/vector10.hpp:18,
                 from ./boost/fusion/container/vector/vector_fwd.hpp:14,
                 from ./boost/fusion/mpl/detail/clear.hpp:10,
                 from ./boost/fusion/mpl/clear.hpp:12,
                 from ./boost/fusion/mpl.hpp:17,
                 from ./boost/fusion/view/detail/strictest_traversal.hpp:15,
                 from ./boost/fusion/view/transform_view/transform_view.hpp:20,
                 from ./boost/fusion/view/transform_view.hpp:10,
                 from ./boost/fusion/include/transform_view.hpp:10,
                 from ./boost/proto/fusion.hpp:24,
                 from ./boost/proto/core.hpp:21,
                 from ./boost/xpressive/regex_primitives.hpp:28,
                 from ./boost/xpressive/xpressive_static.hpp:24,
                 from ./boost/graph/graphviz.hpp:31,
                 from ./boost/graph/graphml.hpp:20,
                 from libs/graph/src/graphml.cpp:17:
./boost/fusion/container/vector/detail/prior_impl.hpp:29:44: error: declaration does not declare anything [-fpermissive]
./boost/fusion/container/vector/detail/prior_impl.hpp:31:41: error: 'vector' was not declared in this scope
./boost/fusion/container/vector/detail/prior_impl.hpp:31:41: note: suggested alternatives:
/lpg-build/cdc/fast_prod/wrlinux501/dvd_install/lx34_12sp/wrlinux-5/layers/wr-toolchain/4.6a-99/bin/../lib/gcc/powerpc-wrs-linux-gnu/4.6.3/../../../../powerpc-wrs-linux-gnu/include/c++/4.6.3/bits/stl_vector.h:180:11: note:   'std::vector'
./boost/mpl/aux_/preprocessed/gcc/vector.hpp:22:8: note:   'boost::mpl::vector'
./boost/container/container_fwd.hpp:53:7: note:   'boost::container::vector'
/lpg-build/cdc/fast_prod/wrlinux501/dvd_install/lx34_12sp/wrlinux-5/layers/wr-toolchain/4.6a-99/bin/../lib/gcc/powerpc-wrs-linux-gnu/4.6.3/../../../../powerpc-wrs-linux-gnu/include/c++/4.6.3/bits/stl_vector.h:180:11: note:   'std::vector'
/lpg-build/cdc/fast_prod/wrlinux501/dvd_install/lx34_12sp/wrlinux-5/layers/wr-toolchain/4.6a-99/bin/../lib/gcc/powerpc-wrs-linux-gnu/4.6.3/../../../../powerpc-wrs-linux-gnu/include/c++/4.6.3/bits/stl_vector.h:180:11: note:   'std::vector'
/lpg-build/cdc/fast_prod/wrlinux501/dvd_install/lx34_12sp/wrlinux-5/layers/wr-toolchain/4.6a-99/bin/../lib/gcc/powerpc-wrs-linux-gnu/4.6.3/../../../../powerpc-wrs-linux-gnu/include/c++/4.6.3/bits/stl_vector.h:180:11: note:   'std::vector'
/lpg-build/cdc/fast_prod/wrlinux501/dvd_install/lx34_12sp/wrlinux-5/layers/wr-toolchain/4.6a-99/bin/../lib/gcc/powerpc-wrs-linux-gnu/4.6.3/../../../../powerpc-wrs-linux-gnu/include/c++/4.6.3/bits/stl_vector.h:180:11: note:   'std::vector'
./boost/fusion/container/vector/detail/prior_impl.hpp:31:63: error: template argument 1 is invalid
In file included from ./boost/fusion/container/vector/vector_iterator.hpp:17:0,
                 from ./boost/fusion/container/vector/detail/begin_impl.hpp:10,
                 from ./boost/fusion/container/vector/vector10.hpp:18,
                 from ./boost/fusion/container/vector/vector_fwd.hpp:14,
                 from ./boost/fusion/mpl/detail/clear.hpp:10,
                 from ./boost/fusion/mpl/clear.hpp:12,
                 from ./boost/fusion/mpl.hpp:17,
                 from ./boost/fusion/view/detail/strictest_traversal.hpp:15,
                 from ./boost/fusion/view/transform_view/transform_view.hpp:20,
                 from ./boost/fusion/view/transform_view.hpp:10,
                 from ./boost/fusion/include/transform_view.hpp:10,
                 from ./boost/proto/fusion.hpp:24,
                 from ./boost/proto/core.hpp:21,
                 from ./boost/xpressive/regex_primitives.hpp:28,
                 from ./boost/xpressive/xpressive_static.hpp:24,
                 from ./boost/graph/graphviz.hpp:31,
                 from ./boost/graph/graphml.hpp:20,
                 from libs/graph/src/graphml.cpp:17:
./boost/fusion/container/vector/detail/advance_impl.hpp:29:44: error: declaration does not declare anything [-fpermissive]
./boost/fusion/container/vector/detail/advance_impl.hpp:30:41: error: 'vector' was not declared in this scope
./boost/fusion/container/vector/detail/advance_impl.hpp:30:41: note: suggested alternatives:
/lpg-build/cdc/fast_prod/wrlinux501/dvd_install/lx34_12sp/wrlinux-5/layers/wr-toolchain/4.6a-99/bin/../lib/gcc/powerpc-wrs-linux-gnu/4.6.3/../../../../powerpc-wrs-linux-gnu/include/c++/4.6.3/bits/stl_vector.h:180:11: note:   'std::vector'
./boost/mpl/aux_/preprocessed/gcc/vector.hpp:22:8: note:   'boost::mpl::vector'
./boost/container/container_fwd.hpp:53:7: note:   'boost::container::vector'
/lpg-build/cdc/fast_prod/wrlinux501/dvd_install/lx34_12sp/wrlinux-5/layers/wr-toolchain/4.6a-99/bin/../lib/gcc/powerpc-wrs-linux-gnu/4.6.3/../../../../powerpc-wrs-linux-gnu/include/c++/4.6.3/bits/stl_vector.h:180:11: note:   'std::vector'
/lpg-build/cdc/fast_prod/wrlinux501/dvd_install/lx34_12sp/wrlinux-5/layers/wr-toolchain/4.6a-99/bin/../lib/gcc/powerpc-wrs-linux-gnu/4.6.3/../../../../powerpc-wrs-linux-gnu/include/c++/4.6.3/bits/stl_vector.h:180:11: note:   'std::vector'
/lpg-build/cdc/fast_prod/wrlinux501/dvd_install/lx34_12sp/wrlinux-5/layers/wr-toolchain/4.6a-99/bin/../lib/gcc/powerpc-wrs-linux-gnu/4.6.3/../../../../powerpc-wrs-linux-gnu/include/c++/4.6.3/bits/stl_vector.h:180:11: note:   'std::vector'
/lpg-build/cdc/fast_prod/wrlinux501/dvd_install/lx34_12sp/wrlinux-5/layers/wr-toolchain/4.6a-99/bin/../lib/gcc/powerpc-wrs-linux-gnu/4.6.3/../../../../powerpc-wrs-linux-gnu/include/c++/4.6.3/bits/stl_vector.h:180:11: note:   'std::vector'
./boost/fusion/container/vector/detail/advance_impl.hpp:30:70: error: template argument 1 is invalid

    "ppce6500-wrswrap-linux-gnu-g++" "-mcpu=e5500" "-mspe=no" "-mno-altivec" "-mcpu=e6500" "-maltivec" "-Wl,-O1" "-Wl,--hash-style=gnu" "--sysroot=/t4xxx_cgl/bitbake_build/tmp/sysroots/fsl-t4xxx"  -ftemplate-depth-128 -O3 -finline-functions -Wno-inline -Wall -pthread  -DBOOST_ALL_NO_LIB=1 -DNDEBUG  -I"." -I"libs/graph/src" -c -o "bin.v2/libs/graph/build/69ffc88faf507005827aa061bd65b9bd/graphml.o" "libs/graph/src/graphml.cpp"

...failed gcc.compile.c++ bin.v2/libs/graph/build/69ffc88faf507005827aa061bd65b9bd/graphml.o...
...skipped <pbin.v2/libs/graph/build/69ffc88faf507005827aa061bd65b9bd>libboost_graph.a(clean) for lack of <pbin.v2/libs/graph/build/69ffc88faf507005827aa061bd65b9bd>read_graphviz_new.o...
...skipped <pbin.v2/libs/graph/build/69ffc88faf507005827aa061bd65b9bd>libboost_graph.a for lack of <pbin.v2/libs/graph/build/69ffc88faf507005827aa061bd65b9bd>read_graphviz_new.o...
...skipped <pstage/lib>libboost_graph.a for lack of <pbin.v2/libs/graph/build/69ffc88faf507005827aa061bd65b9bd>libboost_graph.a...
common.mkdir bin.v2/libs/iostreams/build/69ffc88faf507005827aa061bd65b9bd
gcc.compile.c++ bin.v2/libs/iostreams/build/69ffc88faf507005827aa061bd65b9bd/file_descriptor.o
gcc.compile.c++ bin.v2/libs/iostreams/build/69ffc88faf507005827aa061bd65b9bd/mapped_file.o
gcc.archive bin.v2/libs/iostreams/build/69ffc88faf507005827aa061bd65b9bd/libboost_iostreams.a
common.copy stage/lib/libboost_iostreams.a
common.mkdir bin.v2/libs/program_options/build/69ffc88faf507005827aa061bd65b9bd
gcc.compile.c++ bin.v2/libs/program_options/build/69ffc88faf507005827aa061bd65b9bd/cmdline.o
gcc.compile.c++ bin.v2/libs/program_options/build/69ffc88faf507005827aa061bd65b9bd/config_file.o
gcc.compile.c++ bin.v2/libs/program_options/build/69ffc88faf507005827aa061bd65b9bd/options_description.o
gcc.compile.c++ bin.v2/libs/program_options/build/69ffc88faf507005827aa061bd65b9bd/parsers.o
gcc.compile.c++ bin.v2/libs/program_options/build/69ffc88faf507005827aa061bd65b9bd/variables_map.o
gcc.compile.c++ bin.v2/libs/program_options/build/69ffc88faf507005827aa061bd65b9bd/value_semantic.o
gcc.compile.c++ bin.v2/libs/program_options/build/69ffc88faf507005827aa061bd65b9bd/positional_options.o
gcc.compile.c++ bin.v2/libs/program_options/build/69ffc88faf507005827aa061bd65b9bd/utf8_codecvt_facet.o
gcc.compile.c++ bin.v2/libs/program_options/build/69ffc88faf507005827aa061bd65b9bd/convert.o
gcc.compile.c++ bin.v2/libs/program_options/build/69ffc88faf507005827aa061bd65b9bd/winmain.o
gcc.compile.c++ bin.v2/libs/program_options/build/69ffc88faf507005827aa061bd65b9bd/split.o
gcc.archive bin.v2/libs/program_options/build/69ffc88faf507005827aa061bd65b9bd/libboost_program_options.a
common.copy stage/lib/libboost_program_options.a
common.mkdir bin.v2/libs/signals/build/69ffc88faf507005827aa061bd65b9bd
gcc.compile.c++ bin.v2/libs/signals/build/69ffc88faf507005827aa061bd65b9bd/trackable.o
gcc.compile.c++ bin.v2/libs/signals/build/69ffc88faf507005827aa061bd65b9bd/connection.o
gcc.compile.c++ bin.v2/libs/signals/build/69ffc88faf507005827aa061bd65b9bd/named_slot_map.o
gcc.compile.c++ bin.v2/libs/signals/build/69ffc88faf507005827aa061bd65b9bd/signal_base.o
gcc.compile.c++ bin.v2/libs/signals/build/69ffc88faf507005827aa061bd65b9bd/slot.o
gcc.archive bin.v2/libs/signals/build/69ffc88faf507005827aa061bd65b9bd/libboost_signals.a
common.copy stage/lib/libboost_signals.a
gcc.compile.c++ bin.v2/libs/test/build/69ffc88faf507005827aa061bd65b9bd/cpp_main.o
gcc.archive bin.v2/libs/test/build/69ffc88faf507005827aa061bd65b9bd/libboost_prg_exec_monitor.a
common.copy stage/lib/libboost_prg_exec_monitor.a
gcc.compile.c++ bin.v2/libs/test/build/69ffc88faf507005827aa061bd65b9bd/exception_safety.o
gcc.compile.c++ bin.v2/libs/test/build/69ffc88faf507005827aa061bd65b9bd/interaction_based.o
gcc.compile.c++ bin.v2/libs/test/build/69ffc88faf507005827aa061bd65b9bd/logged_expectations.o
gcc.archive bin.v2/libs/test/build/69ffc88faf507005827aa061bd65b9bd/libboost_unit_test_framework.a
common.copy stage/lib/libboost_unit_test_framework.a
common.mkdir bin.v2/libs/chrono/build/69ffc88faf507005827aa061bd65b9bd
gcc.compile.c++ bin.v2/libs/chrono/build/69ffc88faf507005827aa061bd65b9bd/chrono.o
gcc.compile.c++ bin.v2/libs/chrono/build/69ffc88faf507005827aa061bd65b9bd/thread_clock.o
gcc.compile.c++ bin.v2/libs/chrono/build/69ffc88faf507005827aa061bd65b9bd/process_cpu_clocks.o
gcc.archive bin.v2/libs/chrono/build/69ffc88faf507005827aa061bd65b9bd/libboost_chrono.a
common.copy stage/lib/libboost_chrono.a
common.mkdir bin.v2/libs/thread/build/69ffc88faf507005827aa061bd65b9bd
common.mkdir bin.v2/libs/thread/build/69ffc88faf507005827aa061bd65b9bd/pthread
gcc.compile.c++ bin.v2/libs/thread/build/69ffc88faf507005827aa061bd65b9bd/pthread/thread.o
gcc.compile.c++ bin.v2/libs/thread/build/69ffc88faf507005827aa061bd65b9bd/pthread/once.o
gcc.compile.c++ bin.v2/libs/thread/build/69ffc88faf507005827aa061bd65b9bd/future.o
gcc.archive bin.v2/libs/thread/build/69ffc88faf507005827aa061bd65b9bd/libboost_thread.a
common.copy stage/lib/libboost_thread.a
...failed updating 4 targets...
...skipped 6 targets...
...updated 264 targets...
+ bb_exit_handler
+ ret=1
+ case $ret in
+ case $BASH_VERSION in
+ echo 'WARNING: /t4xxx_cgl/bitbake_build/tmp/work/ppce6500-wrs-linux/boost-1.50.0-r3.1/temp/do_compile/run.do_compile.16563:103 exit 1 from
  bjam' -sTOOLS=gcc ''\''-sGCC=ppce6500-wrswrap-linux-gnu-gcc' -mcpu=e5500 -mspe=no -mno-altivec -mcpu=e6500 -maltivec -Wl,-O1 -Wl,--hash-style=gnu --sysroot=/t4xxx_cgl/bitbake_build/tmp/sysroots/fsl-t4xxx ''\''"'\''-DBOOST_PLATFORM_CONFIG=\"boost/config/platform/linux.hpp\"'\''"' ''\''-sGXX=ppce6500-wrswrap-linux-gnu-g++' -mcpu=e5500 -mspe=no -mno-altivec -mcpu=e6500 -maltivec -Wl,-O1 -Wl,--hash-style=gnu --sysroot=/t4xxx_cgl/bitbake_build/tmp/sysroots/fsl-t4xxx ''\''"'\''-DBOOST_PLATFORM_CONFIG=\"boost/config/platform/linux.hpp\"'\''"' ''\''-sGCC_INCLUDE_DIRECTORY=/t4xxx_cgl/bitbake_build/tmp/sysroots/fsl-t4xxx/usr/include'\''' ''\''-sGCC_STDLIB_DIRECTORY=/t4xxx_cgl/bitbake_build/tmp/sysroots/fsl-t4xxx/usr/lib'\''' ''\''-sNO_BZIP2=1'\''' ''\''-sNO_ZLIB=1'\''' ''\''-sBUILD=release' '<optimization>space' '<threading>multi' '<inlining>on' '<debug-symbols>off'\''' ''\''-sPYTHON_VERSION=${PYTHON_VERSION}'\''' ''\''--layout=system'\''' -sBOOST_BUILD_USER_CONFIG=/t4xxx_cgl/bitbake_build/tmp/work/ppce6500-wrs-linux/boost-1.50.0-r3.1/boost_1_50_0/tools/build/v2/user-config.jam --builddir=/t4xxx_cgl/bitbake_build/tmp/work/ppce6500-wrs-linux/boost-1.50.0-r3.1/boost_1_50_0/powerpc-wrs-linux --disable-icu --with-date_time --with-filesystem --with-graph --with-iostreams --with-program_options --with-regex --with-signals --with-system --with-test --with-thread --prefix=/usr --exec-prefix=/usr --libdir=/usr/lib --includedir=/usr/include
WARNING: /t4xxx_cgl/bitbake_build/tmp/work/ppce6500-wrs-linux/boost-1.50.0-r3.1/temp/do_compile/run.do_compile.16563:103 exit 1 from
  bjam -sTOOLS=gcc '-sGCC=ppce6500-wrswrap-linux-gnu-gcc -mcpu=e5500 -mspe=no -mno-altivec -mcpu=e6500 -maltivec -Wl,-O1 -Wl,--hash-style=gnu --sysroot=/t4xxx_cgl/bitbake_build/tmp/sysroots/fsl-t4xxx '"'-DBOOST_PLATFORM_CONFIG=\"boost/config/platform/linux.hpp\"'" '-sGXX=ppce6500-wrswrap-linux-gnu-g++ -mcpu=e5500 -mspe=no -mno-altivec -mcpu=e6500 -maltivec -Wl,-O1 -Wl,--hash-style=gnu --sysroot=/t4xxx_cgl/bitbake_build/tmp/sysroots/fsl-t4xxx '"'-DBOOST_PLATFORM_CONFIG=\"boost/config/platform/linux.hpp\"'" '-sGCC_INCLUDE_DIRECTORY=/t4xxx_cgl/bitbake_build/tmp/sysroots/fsl-t4xxx/usr/include' '-sGCC_STDLIB_DIRECTORY=/t4xxx_cgl/bitbake_build/tmp/sysroots/fsl-t4xxx/usr/lib' '-sNO_BZIP2=1' '-sNO_ZLIB=1' '-sBUILD=release <optimization>space <threading>multi <inlining>on <debug-symbols>off' '-sPYTHON_VERSION=${PYTHON_VERSION}' '--layout=system' -sBOOST_BUILD_USER_CONFIG=/t4xxx_cgl/bitbake_build/tmp/work/ppce6500-wrs-linux/boost-1.50.0-r3.1/boost_1_50_0/tools/build/v2/user-config.jam --builddir=/t4xxx_cgl/bitbake_build/tmp/work/ppce6500-wrs-linux/boost-1.50.0-r3.1/boost_1_50_0/powerpc-wrs-linux --disable-icu --with-date_time --with-filesystem --with-graph --with-iostreams --with-program_options --with-regex --with-signals --with-system --with-test --with-thread --prefix=/usr --exec-prefix=/usr --libdir=/usr/lib --includedir=/usr/include
+ exit 1
ERROR: Function failed: do_compile (see /t4xxx_cgl/bitbake_build/tmp/work/ppce6500-wrs-linux/boost-1.50.0-r3.1/temp/do_compile/log.do_compile.16563 for further information)

Workaround

Two workarounds available:
1: Add -Dvector=vector to CXXFLAGS to override builtin macro definition.
2: Add -mno-altivec to CXXFLAGS to disable "vector" processing.

Steps to Reproduce

--enable-rootfs=glibc-cgl --enable-board=fsl_t4xxx

Other Downloads


Live chat
Online