Wind River Support Network

HomeDefectsLIN5-6511
Fixed

LIN5-6511 : neard_0.11 failed (d0_compile) of cav-octeon-cn56xx_wor1d_bd.

Created: Sep 2, 2013    Updated: Dec 19, 2017
Resolved Date: Sep 27, 2013
Found In Version: 5.0.1
Fix Version: 5.0.1.8
Severity: Standard
Applicable for: Wind River Linux 5
Component/s: Userspace

Description

NOTE: Resolving any missing task queue dependencies
NOTE: Preparing runqueue
NOTE: Executing SetScene Tasks
NOTE: Executing RunQueue Tasks
ERROR: Function failed: do_compile (see /home/buildadmin/test/bitbake_build/tmp/work/mips32-wrs-linux/neard-0.11-r0/temp/do_compile/log.do_compile.24959 for further information)
ERROR: Logfile of failure stored in: /home/buildadmin/test/bitbake_build/tmp/work/mips32-wrs-linux/neard-0.11-r0/temp/do_compile/log.do_compile.24959
Log data follows:
| DEBUG: SITE files ['endian-big', 'bit-32', 'mips-common', 'common-linux', 'common-glibc', 'mips-linux', 'common']
| DEBUG: Executing shell function do_compile
| NOTE: make -j 20
| make --no-print-directory all-am
| /bin/mkdir -p include/near
| /bin/mkdir -p include/near
| /bin/mkdir -p include/near
| ln -s /home/buildadmin/test/bitbake_build/tmp/work/mips32-wrs-linux/neard-0.11-r0/neard-0.11/include/types.h include/near/types.h
| ln -s /home/buildadmin/test/bitbake_build/tmp/work/mips32-wrs-linux/neard-0.11-r0/neard-0.11/include/log.h include/near/log.h
| /bin/mkdir -p include/near
| ln -s /home/buildadmin/test/bitbake_build/tmp/work/mips32-wrs-linux/neard-0.11-r0/neard-0.11/include/plugin.h include/near/plugin.h
| /bin/mkdir -p include/near
| ln -s /home/buildadmin/test/bitbake_build/tmp/work/mips32-wrs-linux/neard-0.11-r0/neard-0.11/include/tag.h include/near/tag.h
| /bin/mkdir -p include/near
| ln -s /home/buildadmin/test/bitbake_build/tmp/work/mips32-wrs-linux/neard-0.11-r0/neard-0.11/include/adapter.h include/near/adapter.h
| /bin/mkdir -p include/near
| /bin/mkdir -p include/near
| ln -s /home/buildadmin/test/bitbake_build/tmp/work/mips32-wrs-linux/neard-0.11-r0/neard-0.11/include/tlv.h include/near/tlv.h
| ln -s /home/buildadmin/test/bitbake_build/tmp/work/mips32-wrs-linux/neard-0.11-r0/neard-0.11/include/setting.h include/near/setting.h
| /bin/mkdir -p include/near
| /bin/mkdir -p include/near
| /bin/mkdir -p include/near
| ln -s /home/buildadmin/test/bitbake_build/tmp/work/mips32-wrs-linux/neard-0.11-r0/neard-0.11/include/device.h include/near/device.h
| /bin/mkdir -p include/near
| ln -s /home/buildadmin/test/bitbake_build/tmp/work/mips32-wrs-linux/neard-0.11-r0/neard-0.11/include/snep.h include/near/snep.h
| ln -s /home/buildadmin/test/bitbake_build/tmp/work/mips32-wrs-linux/neard-0.11-r0/neard-0.11/include/version.h include/near/version.h
| /bin/mkdir -p include/near
| ln -s /home/buildadmin/test/bitbake_build/tmp/work/mips32-wrs-linux/neard-0.11-r0/neard-0.11/include/dbus.h include/near/dbus.h
| ./src/genbuiltin nfctype1 nfctype2 nfctype3 nfctype4 p2p > src/builtin.h
| mips32-wrswrap-linux-gnu-gcc  -meb -mabi=32   -mhard-float --sysroot=/home/buildadmin/test/bitbake_build/tmp/sysroots/cav-octeon-cn56xx -DHAVE_CONFIG_H -I.  -I./include -I./src -I./gdbus  -I/home/buildadmin/test/bitbake_build/tmp/sysroots/cav-octeon-cn56xx/usr/include/glib-2.0 -I/home/buildadmin/test/bitbake_build/tmp/sysroots/cav-octeon-cn56xx/usr/lib/glib-2.0/include   -I/home/buildadmin/test/bitbake_build/tmp/sysroots/cav-octeon-cn56xx/usr/include/dbus-1.0 -I/home/buildadmin/test/bitbake_build/tmp/sysroots/cav-octeon-cn56xx/usr/lib/dbus-1.0/include   -I/home/buildadmin/test/bitbake_build/tmp/sysroots/cav-octeon-cn56xx/usr/include/libnl3    -DNEAR_PLUGIN_BUILTIN -DPLUGINDIR=\""/usr/lib/near/plugins"\" -DCONFIGDIR=\""/etc/neard\"" -O0 -fno-omit-frame-pointer -g -pipe -c -o tools/snep-send.o tools/snep-send.c
| mips32-wrswrap-linux-gnu-gcc  -meb -mabi=32   -mhard-float --sysroot=/home/buildadmin/test/bitbake_build/tmp/sysroots/cav-octeon-cn56xx -DHAVE_CONFIG_H -I.  -I./include -I./src -I./gdbus  -I/home/buildadmin/test/bitbake_build/tmp/sysroots/cav-octeon-cn56xx/usr/include/glib-2.0 -I/home/buildadmin/test/bitbake_build/tmp/sysroots/cav-octeon-cn56xx/usr/lib/glib-2.0/include   -I/home/buildadmin/test/bitbake_build/tmp/sysroots/cav-octeon-cn56xx/usr/include/dbus-1.0 -I/home/buildadmin/test/bitbake_build/tmp/sysroots/cav-octeon-cn56xx/usr/lib/dbus-1.0/include   -I/home/buildadmin/test/bitbake_build/tmp/sysroots/cav-octeon-cn56xx/usr/include/libnl3    -DNEAR_PLUGIN_BUILTIN -DPLUGINDIR=\""/usr/lib/near/plugins"\" -DCONFIGDIR=\""/etc/neard\"" -O0 -fno-omit-frame-pointer -g -pipe -c -o unit/test-ndef-parse.o unit/test-ndef-parse.c
| mips32-wrswrap-linux-gnu-gcc  -meb -mabi=32   -mhard-float --sysroot=/home/buildadmin/test/bitbake_build/tmp/sysroots/cav-octeon-cn56xx -DHAVE_CONFIG_H -I.  -I./include -I./src -I./gdbus  -I/home/buildadmin/test/bitbake_build/tmp/sysroots/cav-octeon-cn56xx/usr/include/glib-2.0 -I/home/buildadmin/test/bitbake_build/tmp/sysroots/cav-octeon-cn56xx/usr/lib/glib-2.0/include   -I/home/buildadmin/test/bitbake_build/tmp/sysroots/cav-octeon-cn56xx/usr/include/dbus-1.0 -I/home/buildadmin/test/bitbake_build/tmp/sysroots/cav-octeon-cn56xx/usr/lib/dbus-1.0/include   -I/home/buildadmin/test/bitbake_build/tmp/sysroots/cav-octeon-cn56xx/usr/include/libnl3    -DNEAR_PLUGIN_BUILTIN -DPLUGINDIR=\""/usr/lib/near/plugins"\" -DCONFIGDIR=\""/etc/neard\"" -O0 -fno-omit-frame-pointer -g -pipe -c -o unit/test-ndef-build.o unit/test-ndef-build.c
| mips32-wrswrap-linux-gnu-gcc  -meb -mabi=32   -mhard-float --sysroot=/home/buildadmin/test/bitbake_build/tmp/sysroots/cav-octeon-cn56xx -DHAVE_CONFIG_H -I.  -I./include -I./src -I./gdbus  -I/home/buildadmin/test/bitbake_build/tmp/sysroots/cav-octeon-cn56xx/usr/include/glib-2.0 -I/home/buildadmin/test/bitbake_build/tmp/sysroots/cav-octeon-cn56xx/usr/lib/glib-2.0/include   -I/home/buildadmin/test/bitbake_build/tmp/sysroots/cav-octeon-cn56xx/usr/include/dbus-1.0 -I/home/buildadmin/test/bitbake_build/tmp/sysroots/cav-octeon-cn56xx/usr/lib/dbus-1.0/include   -I/home/buildadmin/test/bitbake_build/tmp/sysroots/cav-octeon-cn56xx/usr/include/libnl3    -DNEAR_PLUGIN_BUILTIN -DPLUGINDIR=\""/usr/lib/near/plugins"\" -DCONFIGDIR=\""/etc/neard\"" -O0 -fno-omit-frame-pointer -g -pipe -c -o unit/test-snep-read.o unit/test-snep-read.c
| mips32-wrswrap-linux-gnu-gcc  -meb -mabi=32   -mhard-float --sysroot=/home/buildadmin/test/bitbake_build/tmp/sysroots/cav-octeon-cn56xx -DHAVE_CONFIG_H -I.  -I./include -I./src -I./gdbus  -I/home/buildadmin/test/bitbake_build/tmp/sysroots/cav-octeon-cn56xx/usr/include/glib-2.0 -I/home/buildadmin/test/bitbake_build/tmp/sysroots/cav-octeon-cn56xx/usr/lib/glib-2.0/include   -I/home/buildadmin/test/bitbake_build/tmp/sysroots/cav-octeon-cn56xx/usr/include/dbus-1.0 -I/home/buildadmin/test/bitbake_build/tmp/sysroots/cav-octeon-cn56xx/usr/lib/dbus-1.0/include   -I/home/buildadmin/test/bitbake_build/tmp/sysroots/cav-octeon-cn56xx/usr/include/libnl3    -DNEAR_PLUGIN_BUILTIN -DPLUGINDIR=\""/usr/lib/near/plugins"\" -DCONFIGDIR=\""/etc/neard\"" -O0 -fno-omit-frame-pointer -g -pipe -c -o unit/test-utils.o unit/test-utils.c
| ln -s /home/buildadmin/test/bitbake_build/tmp/work/mips32-wrs-linux/neard-0.11-r0/neard-0.11/include/nfc_copy.h include/near/nfc_copy.h
| tools/snep-send.c:14:23: fatal error: near/ndef.h: No such file or directory
| compilation terminated.
| make[1]: *** [tools/snep-send.o] Error 1
| make[1]: *** Waiting for unfinished jobs....
| In file included from unit/test-utils.h:31:0,
|                  from unit/test-snep-read.c:38:
| ./src/near.h:99:23: fatal error: near/ndef.h: No such file or directory
| compilation terminated.
| In file included from unit/test-utils.h:31:0,
|                  from unit/test-utils.c:21:
| ./src/near.h:99:23: fatal error: near/ndef.h: No such file or directory
| compilation terminated.
| ln -s /home/buildadmin/test/bitbake_build/tmp/work/mips32-wrs-linux/neard-0.11-r0/neard-0.11/include/ndef.h include/near/ndef.h
| make[1]: *** [unit/test-utils.o] Error 1
| make[1]: *** [unit/test-snep-read.o] Error 1
| make: *** [all] Error 2
| ERROR: oe_runmake failed
| WARNING: /home/buildadmin/test/bitbake_build/tmp/work/mips32-wrs-linux/neard-0.11-r0/temp/do_compile/run.do_compile.24959:110 exit 1 from
|   exit 1
| ERROR: Function failed: do_compile (see /home/buildadmin/test/bitbake_build/tmp/work/mips32-wrs-linux/neard-0.11-r0/temp/do_compile/log.do_compile.24959 for further information)
ERROR: Task 7 (/home/buildadmin/test/layers/wr-kernel/recipes-kernel/neard/neard_0.11.bb, do_compile) failed with exit code '1'
NOTE: Tasks Summary: Attempted 1308 tasks of which 1302 didn't need to be rerun and 1 failed.
No currently running tasks (1308 of 1314)

Summary: 1 task failed:
  /home/buildadmin/test/layers/wr-kernel/recipes-kernel/neard/neard_0.11.bb, do_compile
Summary: There was 1 ERROR message shown, returning a non-zero exit code.
make: *** [neard] Error 1

Workaround

make -j 1

Steps to Reproduce

$cav-octeon-cn56xx_world_bd --enable-board=cav-octeon-cn56xx --enable-rootfs=glibc-std-sato --enable-kernel=standard --with-layer=wr-security,meta-selinux --enable-build=debug --enable-bootimage=noimage --enable-parallel-pkgbuilds=20 --enable-jobs=20
$cd build
$while true; do make neard.distclean; make neard; [ $? != 0 ] && break; done

Other Downloads


Live chat
Online