Wind River Support Network

HomeDefectsLIN5-3908
Fixed

LIN5-3908 : gcc-crosssdk-initial-4.6.3+svnr184847-r29.2 do_compile failed on Fedora19 x86_64

Created: Nov 6, 2013    Updated: Dec 19, 2017
Resolved Date: Nov 25, 2013
Found In Version: 5.0.1
Fix Version: 5.0.1.10
Severity: Severe
Applicable for: Wind River Linux 5
Component/s: Userspace

Description

Key logs, for details see make-export-sdk.log in attachments.

ERROR: Function failed: do_compile (see /combo1-intel-xeon-core-ovp-ovirt-node/bitbake_build/tmp/work/
x86_64-wrlinuxsdk-linux/gcc-crosssdk-initial-4.6.3+svnr184847-r29.2/temp/do_compile/log.do_compile.14186 for further information)
ERROR: Logfile of failure stored in: /combo1-intel-xeon-core-ovp-ovirt-node/bitbake_build/tmp/work/x86
_64-wrlinuxsdk-linux/gcc-crosssdk-initial-4.6.3+svnr184847-r29.2/temp/do_compile/log.do_compile.14186
Log data follows:
| DEBUG: SITE files ['endian-little', 'common-linux', 'common-glibc', 'bit-64', 'x86_64-linux', 'common']
| DEBUG: Executing shell function do_compile
| NOTE: make -j 16 ARCH_FLAGS_FOR_TARGET= -isystem/combo1-intel-xeon-core-ovp-ovirt-node/bitbake_build
/tmp/sysroots/x86_64-nativesdk-wrlinuxsdk-linux/opt/windriver/wrlinux/5.0-intel-xeon-core/sysroots/x86_64-wrlinuxsdk-linux/usr/include
| make[1]: Entering directory `/combo1-intel-xeon-core-ovp-ovirt-node/bitbake_build/tmp/work/x86_64-wr
linuxsdk-linux/gcc-crosssdk-initial-4.6.3+svnr184847-r29.2/gcc-4_6-branch/build.x86_64-linux.x86_64-wrlinuxsdk-linux'
| mkdir -p -- ./fixincludes
| mkdir -p -- ./libiberty
| mkdir -p -- ./libdecnumber
| mkdir -p -- ./intl
| Configuring in ./fixincludes
| Configuring in ./libdecnumber
| mkdir -p -- build-x86_64-linux/libiberty
| Configuring in ./libiberty
| mkdir -p -- build-x86_64-linux/fixincludes
| Configuring in build-x86_64-linux/libiberty
| Configuring in build-x86_64-linux/fixincludes
| Configuring in ./intl
| configure: creating cache ./config.cache
| checking whether make sets $(MAKE)... configure: creating cache ../config.cache
| configure: loading cache ../config.cache
| checking whether to enable maintainer-specific portions of Makefiles... no
| checking for makeinfo... makeinfo --split-size=5000000
| configure: creating cache ./config.cache
| configure: creating cache ./config.cache
| yes
| checking for perl... checking for x86_64-linux-gcc... gcc
| perl
| checking whether to enable maintainer-specific portions of Makefiles... no
| checking for makeinfo... makeinfo --split-size=5000000
| checking for perl... perl
| checking build system type... checking build system type... configure: creating cache ./config.cache
| checking build system type... checking whether make sets $(MAKE)... checking build system type... yes
/failed                                                                                                                                                
|
| /combo1-intel-xeon-core-ovp-ovirt-node/bitbake_build/tmp/work-shared/gcc-4.6.3+svnr184847-r29.2/gcc-
4_6-branch/libgcc/../gcc/libgcc2.c: In function '__multi3':
| /combo1-intel-xeon-core-ovp-ovirt-node/bitbake_build/tmp/work-shared/gcc-4.6.3+svnr184847-r29.2/gcc-
4_6-branch/libgcc/../gcc/libgcc2.c:558:1: internal compiler error: Segmentation fault
| Please submit a full bug report,
| with preprocessed source if appropriate.
| See <http://gcc.gnu.org/bugs.html> for instructions.
| make[2]: *** [_muldi3.o] Error 1
| make[2]: *** Waiting for unfinished jobs....
| /combo1-intel-xeon-core-ovp-ovirt-node/bitbake_build/tmp/work-shared/gcc-4.6.3+svnr184847-r29.2/gcc-
4_6-branch/libgcc/../gcc/libgcc2.c: In function '__cmpti2':
| /combo1-intel-xeon-core-ovp-ovirt-node/bitbake_build/tmp/work-shared/gcc-4.6.3+svnr184847-r29.2/gcc-
4_6-branch/libgcc/../gcc/libgcc2.c:1156:1: internal compiler error: Segmentation fault
| Please submit a full bug report,
| with preprocessed source if appropriate.
| See <http://gcc.gnu.org/bugs.html> for instructions.
| make[2]: *** [_cmpdi2.o] Error 1
| /combo1-intel-xeon-core-ovp-ovirt-node/bitbake_build/tmp/work-shared/gcc-4.6.3+svnr184847-r29.2/gcc-
4_6-branch/libgcc/../gcc/libgcc2.c: In function '__addvti3':
| /combo1-intel-xeon-core-ovp-ovirt-node/bitbake_build/tmp/work-shared/gcc-4.6.3+svnr184847-r29.2/gcc-
4_6-branch/libgcc/../gcc/libgcc2.c:110:1: internal compiler error: Segmentation fault
| Please submit a full bug report,
| with preprocessed source if appropriate.
| See <http://gcc.gnu.org/bugs.html> for instructions.
| make[2]: *** [_addvdi3.o] Error 1
| /combo1-intel-xeon-core-ovp-ovirt-node/bitbake_build/tmp/work-shared/gcc-4.6.3+svnr184847-r29.2/gcc-
4_6-branch/libgcc/../gcc/libgcc2.c: In function '__ucmpti2':
| /combo1-intel-xeon-core-ovp-ovirt-node/bitbake_build/tmp/work-shared/gcc-4.6.3+svnr184847-r29.2/gcc-
4_6-branch/libgcc/../gcc/libgcc2.c:1175:1: internal compiler error: Segmentation fault
| Please submit a full bug report,
| with preprocessed source if appropriate.
| See <http://gcc.gnu.org/bugs.html> for instructions.
| make[2]: *** [_ucmpdi2.o] Error 1
| /combo1-intel-xeon-core-ovp-ovirt-node/bitbake_build/tmp/work-shared/gcc-4.6.3+svnr184847-r29.2/gcc-
4_6-branch/libgcc/../gcc/libgcc2.c: In function '__absvti2':
| /combo1-intel-xeon-core-ovp-ovirt-node/bitbake_build/tmp/work-shared/gcc-4.6.3+svnr184847-r29.2/gcc-
4_6-branch/libgcc/../gcc/libgcc2.c:272:1: internal compiler error: Segmentation fault
| Please submit a full bug report,
| with preprocessed source if appropriate.
| See <http://gcc.gnu.org/bugs.html> for instructions.
| make[2]: *** [_absvdi2.o] Error 1
| make[2]: Leaving directory `/combo1-intel-xeon-core-ovp-ovirt-node/bitbake_build/tmp/work/x86_64-wrl
inuxsdk-linux/gcc-crosssdk-initial-4.6.3+svnr184847-r29.2/gcc-4_6-branch/build.x86_64-linux.x86_64-wrlinuxsdk-linux/x86_64-wrlinuxsdk-linux/libgcc'
| make[1]: *** [all-target-libgcc] Error 2
| make[1]: Leaving directory `/combo1-intel-xeon-core-ovp-ovirt-node/bitbake_build/tmp/work/x86_64-wrl
inuxsdk-linux/gcc-crosssdk-initial-4.6.3+svnr184847-r29.2/gcc-4_6-branch/build.x86_64-linux.x86_64-wrlinuxsdk-linux'
| make: *** [all] Error 2
| ERROR: oe_runmake failed
| WARNING: /combo1-intel-xeon-core-ovp-ovirt-node/bitbake_build/tmp/work/x86_64-wrlinuxsdk-linux/gcc-c
rosssdk-initial-4.6.3+svnr184847-r29.2/temp/do_compile/run.do_compile.14186:115 exit 1 from
|   exit 1
| ERROR: Function failed: do_compile (see /combo1-intel-xeon-core-ovp-ovirt-node/bitbake_build/tmp/wor
k/x86_64-wrlinuxsdk-linux/gcc-crosssdk-initial-4.6.3+svnr184847-r29.2/temp/do_compile/log.do_compile.14186 for further information)
NOTE: recipe gcc-crosssdk-initial-4.6.3+svnr184847-r29.2: task do_compile: Failed
ERROR: Task 5237 (/combo1-intel-xeon-core-ovp-ovirt-node/layers/oe-core/meta/recipes-devtools/gcc/gcc-
crosssdk-initial_4.6.bb, do_compile) failed with exit code '1'
NOTE: recipe qt4-native-4.7.4-r15.1: task do_configure: Succeeded
NOTE: Tasks Summary: Attempted 4961 tasks of which 4743 didn't need to be rerun and 1 failed.

Summary: 1 task failed:
  /combo1-intel-xeon-core-ovp-ovirt-node/layers/oe-core/meta/recipes-devtools/gcc/gcc-crosssdk-initial
_4.6.bb, do_compile
Summary: There was 1 ERROR message shown, returning a non-zero exit code.
make[1]: *** [populate-sdk] Error 1
make[1]: Leaving directory `/buildarea2/ovp_host_build/11061337-ovp_host_export_sdk_WR_20131106/combo1-intel-xeon-core-ovp-ovirt-node'
make: *** [export-sdk] Error 2

Steps to Reproduce

1). /wrlinuxovp/wrlinux-x//wrlinux/configure --enable-board=intel-xeon-core --enable-addons=wr-ovp --enable-rootfs=ovp-ovirt-node --with-template=feature/openvswitch,feature/ovp-benchmark,feature/vxlan,feature/virtio,feature/target-toolchain,feature/benchmark --enable-parallel-pkgbuilds=16 --enable-jobs=16 --with-sstate-dir=/buildarea2/ovp_host_build/SSTATE_CACHE
2). make fs
3).make export-sdk

Other Downloads


Live chat
Online