Wind River Support Network

HomeDefectsLIN5-3845
Fixed

LIN5-3845 : [RCPL5008]systemtap do compile failed on Fedora19 64 bit

Created: Oct 14, 2013    Updated: Dec 19, 2017
Resolved Date: Oct 30, 2013
Found In Version: 5.0.1
Fix Version: 5.0.1.9
Severity: Severe
Applicable for: Wind River Linux 5
Component/s: Userspace

Description

 g++ -DHAVE_CONFIG_H -I. -DBINDIR='"/qemuppc/bitbake_build/tmp/sysroots/x86_64-linux/usr/bin"' -DSYSCONFDIR='"/qemuppc/bitbake_build/tmp/sysroots/x86_64-linux/etc"' -DPKGDATADIR='"/qemuppc/bitbake_build/tmp/sysroots/x86_64-linux/usr/share/systemtap"' -DPKGLIBDIR='"/qemuppc/bitbake_build/tmp/sysroots/x86_64-linux/usr/libexec/systemtap"' -DLOCALEDIR='"/qemuppc/bitbake_build/tmp/sysroots/x86_64-linux/usr/share/locale"' -I./includes -I./includes/sys -DSTAP_SDT_V2 -isystem/qemuppc/bitbake_build/tmp/sysroots/x86_64-linux/usr/include -Wall -Werror -isystem/qemuppc/bitbake_build/tmp/sysroots/x86_64-linux/usr/include -O2 -pipe -fstack-protector-all -D_FORTIFY_SOURCE=2 -c -o stap-tapset-been.o `test -f 'tapset-been.cxx' || echo './'`tapset-been.cxx
| tapsets.cxx: In constructor 'sdt_query::sdt_query(probe*, probe_point*, dwflpp&, const literal_map_t&, std::vector<derived_probe*>&, std::string)':
| tapsets.cxx:5927:1: error: 'sdt_query::probe_type' is initialized with itself [-Werror=init-self]
|  sdt_query::sdt_query(probe * base_probe, probe_point * base_loc,
|  ^
| tapsets.cxx:5927:1: error: 'sdt_query::probe_loc' is initialized with itself [-Werror=init-self]
| g++ -DHAVE_CONFIG_H -I. -DBINDIR='"/qemuppc/bitbake_build/tmp/sysroots/x86_64-linux/usr/bin"' -DSYSCONFDIR='"/qemuppc/bitbake_build/tmp/sysroots/x86_64-linux/etc"' -DPKGDATADIR='"/qemuppc/bitbake_build/tmp/sysroots/x86_64-linux/usr/share/systemtap"' -DPKGLIBDIR='"/qemuppc/bitbake_build/tmp/sysroots/x86_64-linux/usr/libexec/systemtap"' -DLOCALEDIR='"/qemuppc/bitbake_build/tmp/sysroots/x86_64-linux/usr/share/locale"' -I./includes -I./includes/sys -DSTAP_SDT_V2 -isystem/qemuppc/bitbake_build/tmp/sysroots/x86_64-linux/usr/include -Wall -Werror -isystem/qemuppc/bitbake_build/tmp/sysroots/x86_64-linux/usr/include -O2 -pipe -fstack-protector-all -D_FORTIFY_SOURCE=2 -c -o stap-tapset-procfs.o `test -f 'tapset-procfs.cxx' || echo './'`tapset-procfs.cxx
| cc1plus: all warnings being treated as errors
| make[2]: *** [stap-tapsets.o] Error 1
| make[2]: *** Waiting for unfinished jobs....
| make[2]: Leaving directory `/qemuppc/bitbake_build/tmp/work/x86_64-linux/systemtap-native-1.7+gitAUTOINC+83bd2699d8cff2f2d6b9eaf5ea254e4cb6b33e81-r5/git'
| make[1]: *** [all-recursive] Error 1
| make[1]: Leaving directory `/qemuppc/bitbake_build/tmp/work/x86_64-linux/systemtap-native-1.7+gitAUTOINC+83bd2699d8cff2f2d6b9eaf5ea254e4cb6b33e81-r5/git'
| make: *** [all] Error 2
| ERROR: oe_runmake failed
| WARNING: /qemuppc/bitbake_build/tmp/work/x86_64-linux/systemtap-native-1.7+gitAUTOINC+83bd2699d8cff2f2d6b9eaf5ea254e4cb6b33e81-r5/temp/do_compile/run.do_compile.16286:113 exit 1 from
|   exit 1
| ERROR: Function failed: do_compile (see /qemuppc/bitbake_build/tmp/work/x86_64-linux/systemtap-native-1.7+gitAUTOINC+83bd2699d8cff2f2d6b9eaf5ea254e4cb6b33e81-r5/temp/do_compile/log.do_compile.16286 for further information)
ERROR: Task 179 (virtual:native:/qemuppc/layers/oe-core/meta/recipes-kernel/systemtap/systemtap_git.bb, do_compile) failed with exit code '1'
NOTE: Tasks Summary: Attempted 668 tasks of which 667 didn't need to be rerun and 1 failed.
No currently running tasks (424 of 681)

Summary: 1 task failed:
virtual:native:/qemuppc/layers/oe-core/meta/recipes-kernel/systemtap/systemtap_git.bb, do_compile
Summary: There was 1 ERROR message shown, returning a non-zero exit code.
make: *** [bbc] Error 1 

Steps to Reproduce

1)configure --enable-board=qemuppc --enable-kernel=standard --enable-rootfs=glibc-std --enable-parallel-pkgbuilds=6 --enable-jobs=6

2)make fs

Other Downloads


Live chat
Online