Wind River Support Network

HomeDefectsLIN5-3398
Fixed

LIN5-3398 : [Feature Testing][networking]: avl.23.0 in CUT show the wrong result on BSP: cav-octeon2

Created: May 21, 2013    Updated: Dec 19, 2017
Resolved Date: Jun 3, 2013
Found In Version: 5.0.1
Fix Version: 5.0.1.4
Severity: Severe
Applicable for: Wind River Linux 5
Component/s: Networking

Description

Problem Description
======================
avl.23.0 in CUT show the wrong result on BSP: cav-octeon2.
All the subtest PASSed, but the script show the "FAILED" result.

Expected Behavior
======================
Show the right result.

Observed Behavior
======================
root@CN68xx_2:/opt/cut# cat testlog-May-18-13-04\:37.log 

----------------------------------------
Start testcase  AVL.23.0 Watchdog Timer Pre-Timeout Interrupt
----------------------------------------
saftest-1.0.8-r2.mips64octeon2_nf_n32
sed: -e expression #1, char 25: unknown option to `s'
/opt/cut/testcase/avl.23.0: line 45: hpi/openhpi.conf: No such file or directory
sed: -e expression #1, char 28: unknown option to `s'
Starting OpenHPI: 
 ... success
./run_tests.sh: line 40: 16086 Alarm clock             $TIMEOUT_EXE 0 > /dev/null 2>&1
/opt/saftest/HPI-B.01.01/src/watchdogtimer/saHpiWatchdogTimerGet/5.test PASS
/opt/saftest/HPI-B.01.01/src/watchdogtimer/saHpiWatchdogTimerGet/2.test PASS
/opt/saftest/HPI-B.01.01/src/watchdogtimer/saHpiWatchdogTimerGet/4.test PASS
/opt/saftest/HPI-B.01.01/src/watchdogtimer/saHpiWatchdogTimerGet/3.test PASS
/opt/saftest/HPI-B.01.01/src/watchdogtimer/saHpiWatchdogTimerGet/1.test PASS
/opt/saftest/HPI-B.01.01/src/watchdogtimer/saHpiWatchdogTimerGet/6.test PASS
/opt/saftest/HPI-B.01.01/src/watchdogtimer/saHpiWatchdogTimerReset/5.test PASS
/opt/saftest/HPI-B.01.01/src/watchdogtimer/saHpiWatchdogTimerReset/2.test PASS
/opt/saftest/HPI-B.01.01/src/watchdogtimer/saHpiWatchdogTimerReset/4.test PASS
/opt/saftest/HPI-B.01.01/src/watchdogtimer/saHpiWatchdogTimerReset/3.test PASS
/opt/saftest/HPI-B.01.01/src/watchdogtimer/saHpiWatchdogTimerReset/1.test PASS
/opt/saftest/HPI-B.01.01/src/watchdogtimer/saHpiWatchdogTimerSet/7.test PASS
/opt/saftest/HPI-B.01.01/src/watchdogtimer/saHpiWatchdogTimerSet/5.test PASS
/opt/saftest/HPI-B.01.01/src/watchdogtimer/saHpiWatchdogTimerSet/2.test PASS
/opt/saftest/HPI-B.01.01/src/watchdogtimer/saHpiWatchdogTimerSet/10.test PASS
/opt/saftest/HPI-B.01.01/src/watchdogtimer/saHpiWatchdogTimerSet/9.test PASS
/opt/saftest/HPI-B.01.01/src/watchdogtimer/saHpiWatchdogTimerSet/4.test PASS
/opt/saftest/HPI-B.01.01/src/watchdogtimer/saHpiWatchdogTimerSet/3.test PASS
/opt/saftest/HPI-B.01.01/src/watchdogtimer/saHpiWatchdogTimerSet/1.test PASS
/opt/saftest/HPI-B.01.01/src/watchdogtimer/saHpiWatchdogTimerSet/6.test PASS
/opt/saftest/HPI-B.01.01/src/watchdogtimer/saHpiWatchdogTimerSet/8.test PASS
Test results:
PASSED   21
FAILED   0
UNKNOWN  0
----------------------------------------
/opt/saftest/HPI-B.01.01/src/watchdogtimer/saHpiWatchdogTimerGet/5.test
PASS
/opt/saftest/HPI-B.01.01/src/watchdogtimer/saHpiWatchdogTimerGet/2.test
PASS
/opt/saftest/HPI-B.01.01/src/watchdogtimer/saHpiWatchdogTimerGet/4.test
PASS
/opt/saftest/HPI-B.01.01/src/watchdogtimer/saHpiWatchdogTimerGet/3.test
PASS
/opt/saftest/HPI-B.01.01/src/watchdogtimer/saHpiWatchdogTimerGet/1.test
PASS
/opt/saftest/HPI-B.01.01/src/watchdogtimer/saHpiWatchdogTimerGet/6.test
PASS
/opt/saftest/HPI-B.01.01/src/watchdogtimer/saHpiWatchdogTimerReset/5.test
PASS
/opt/saftest/HPI-B.01.01/src/watchdogtimer/saHpiWatchdogTimerReset/2.test
PASS
/opt/saftest/HPI-B.01.01/src/watchdogtimer/saHpiWatchdogTimerReset/4.test
PASS
/opt/saftest/HPI-B.01.01/src/watchdogtimer/saHpiWatchdogTimerReset/3.test
PASS
/opt/saftest/HPI-B.01.01/src/watchdogtimer/saHpiWatchdogTimerReset/1.test
PASS
/opt/saftest/HPI-B.01.01/src/watchdogtimer/saHpiWatchdogTimerSet/7.test
PASS
/opt/saftest/HPI-B.01.01/src/watchdogtimer/saHpiWatchdogTimerSet/5.test
PASS
/opt/saftest/HPI-B.01.01/src/watchdogtimer/saHpiWatchdogTimerSet/2.test
PASS
/opt/saftest/HPI-B.01.01/src/watchdogtimer/saHpiWatchdogTimerSet/10.test
PASS
/opt/saftest/HPI-B.01.01/src/watchdogtimer/saHpiWatchdogTimerSet/9.test
PASS
/opt/saftest/HPI-B.01.01/src/watchdogtimer/saHpiWatchdogTimerSet/4.test
PASS
/opt/saftest/HPI-B.01.01/src/watchdogtimer/saHpiWatchdogTimerSet/3.test
PASS
/opt/saftest/HPI-B.01.01/src/watchdogtimer/saHpiWatchdogTimerSet/1.test
PASS
/opt/saftest/HPI-B.01.01/src/watchdogtimer/saHpiWatchdogTimerSet/6.test
PASS
/opt/saftest/HPI-B.01.01/src/watchdogtimer/saHpiWatchdogTimerSet/8.test
PASS
****************************************
subtest 0 failed
****************************************
Error step : test failed
Test Result : [ FAILED ]
Clean System...
Stopping OpenHPI:  ... success
Finish
root@CN68xx_2:/opt/cut# 

Steps to Reproduce

1 configure a project
/wrlinux-x/wrlinux/configure --enable-board=cav-octeon2 --enable-kernel=cgl --enable-rootfs=glibc-cgl --enable-parallel-pkgbuilds=16 --enable-jobs=8 --with-layer=/wr-testing/cgl,/wr-testing/networking --with-template=feature/cut
2. make fs
3. start the target with the kernel and rootfs
4. on target run: cd /opt/cut; ./cgl_test.sh -e avl.23.0

Other Downloads


Live chat
Online