Wind River Support Network

HomeDefectsLIN5-2995
Fixed

LIN5-2995 : qat-cck build error

Created: May 23, 2013    Updated: Dec 19, 2017
Resolved Date: Jun 8, 2013
Found In Version: 5.0.1
Fix Version: 5.0.1.4
Severity: Severe
Applicable for: Wind River Linux 5
Component/s: BSP - Async

Description

Problem Description
======================
qat-cck build error

 
Expected Behavior
======================
it should build no error

Observed Behavior
======================
Building for linux_2.6
| make[2]: Entering directory `/tune-test/bitbake_build/tmp/work/intel_xeon_core-wrs-linux/qat-cck-1.0.1-15-r1/quickassist/adf/accel_mgr/src'
| Creating output directory
| Creating static library adf_accel_mgr.a
| make[3]: Entering directory `/tune-test/bitbake_build/tmp/sysroots/intel-xeon-core/usr/src/kernel'
| Building for linux_2.6
|   LD      /tune-test/bitbake_build/tmp/work/intel_xeon_core-wrs-linux/qat-cck-1.0.1-15-r1/quickassist/adf/accel_mgr/src/built-in.o
|   CC      /tune-test/bitbake_build/tmp/work/intel_xeon_core-wrs-linux/qat-cck-1.0.1-15-r1/quickassist/adf/accel_mgr/src/adf_cfg.o
|   CC      /tune-test/bitbake_build/tmp/work/intel_xeon_core-wrs-linux/qat-cck-1.0.1-15-r1/quickassist/adf/accel_mgr/src/adf_cfg_debug.o
|   CC      /tune-test/bitbake_build/tmp/work/intel_xeon_core-wrs-linux/qat-cck-1.0.1-15-r1/quickassist/adf/accel_mgr/src/adf_cfg_dp.o
|   CC      /tune-test/bitbake_build/tmp/work/intel_xeon_core-wrs-linux/qat-cck-1.0.1-15-r1/quickassist/adf/accel_mgr/src/adf_devmgr.o
|   CC      /tune-test/bitbake_build/tmp/work/intel_xeon_core-wrs-linux/qat-cck-1.0.1-15-r1/quickassist/adf/accel_mgr/src/adf_esram.o
|   CC      /tune-test/bitbake_build/tmp/work/intel_xeon_core-wrs-linux/qat-cck-1.0.1-15-r1/quickassist/adf/accel_mgr/src/adf_init.o
|   CC      /tune-test/bitbake_build/tmp/work/intel_xeon_core-wrs-linux/qat-cck-1.0.1-15-r1/quickassist/adf/accel_mgr/src/adf_user_proxy.o
| In file included from /tune-test/bitbake_build/tmp/work/intel_xeon_core-wrs-linux/qat-cck-1.0.1-15-r1/quickassist/adf/accel_mgr/src/adf_user_proxy.c:82:0:
| /tune-test/bitbake_build/tmp/work/intel_xeon_core-wrs-linux/qat-cck-1.0.1-15-r1/quickassist/adf/accel_mgr/src/adf_user_proxy.c: In function 'clean_orphan_list':
| /tune-test/bitbake_build/tmp/work/intel_xeon_core-wrs-linux/qat-cck-1.0.1-15-r1/quickassist/adf/include/icp_adf_transport_dp.h:117:18: error: inlining failed in call to always_inline 'icp_adf_pollQueue': function body not available
| /tune-test/bitbake_build/tmp/work/intel_xeon_core-wrs-linux/qat-cck-1.0.1-15-r1/quickassist/adf/accel_mgr/src/adf_user_proxy.c:289:50: error: called from here
| make[4]: *** [/tune-test/bitbake_build/tmp/work/intel_xeon_core-wrs-linux/qat-cck-1.0.1-15-r1/quickassist/adf/accel_mgr/src/adf_user_proxy.o] Error 1
| make[3]: *** [_module_/tune-test/bitbake_build/tmp/work/intel_xeon_core-wrs-linux/qat-cck-1.0.1-15-r1/quickassist/adf/accel_mgr/src] Error 2
| make[3]: Leaving directory `/tune-test/bitbake_build/tmp/sysroots/intel-xeon-core/usr/src/kernel'
| Copying outputs
| mv: cannot stat `adf_user_proxy.o': No such file or directory
| make[2]: Leaving directory `/tune-test/bitbake_build/tmp/work/intel_xeon_core-wrs-linux/qat-cck-1.0.1-15-r1/quickassist/adf/accel_mgr/src'
| Building for linux_2.6
| make[2]: Entering directory `/tune-test/bitbake_build/tmp/work/intel_xeon_core-wrs-linux/qat-cck-1.0.1-15-r1/quickassist/adf/accel_mgr/src'
| echo "copying /tune-test/bitbake_build/tmp/work/intel_xeon_core-wrs-linux/qat-cck-1.0.1-15-r1/quickassist/adf/accel_mgr/src/build/linux_2.6/kernel_space//adf_accel_mgr.a to /tune-test/bitbake_build/tmp/work/intel_xeon_core-wrs-linux/qat-cck-1.0.1-15-r1/quickassist/adf/build/linux_2.6"; \
|     cp /tune-test/bitbake_build/tmp/work/intel_xeon_core-wrs-linux/qat-cck-1.0.1-15-r1/quickassist/adf/accel_mgr/src/build/linux_2.6/kernel_space//adf_accel_mgr.a/tune-test/bitbake_build/tmp/work/intel_xeon_core-wrs-linux/qat-cck-1.0.1-15-r1/quickassist/adf/build/linux_2.6
| copying /tune-test/bitbake_build/tmp/work/intel_xeon_core-wrs-linux/qat-cck-1.0.1-15-r1/quickassist/adf/accel_mgr/src/build/linux_2.6/kernel_space//adf_accel_mgr.a to /tune-test/bitbake_build/tmp/work/intel_xeon_core-wrs-linux/qat-cck-1.0.1-15-r1/quickassist/adf/build/linux_2.6
| cp: cannot stat `/tune-test/bitbake_build/tmp/work/intel_xeon_core-wrs-linux/qat-cck-1.0.1-15-r1/quickassist/adf/accel_mgr/src/build/linux_2.6/kernel_space//adf_accel_mgr.a': No such file or directory
| make[2]: *** [copy] Error 1
| make[2]: Leaving directory `/tune-test/bitbake_build/tmp/work/intel_xeon_core-wrs-linux/qat-cck-1.0.1-15-r1/quickassist/adf/accel_mgr/src'
| make[1]: *** [adf] Error 1
| make[1]: Leaving directory `/tune-test/bitbake_build/tmp/work/intel_xeon_core-wrs-linux/qat-cck-1.0.1-15-r1/quickassist/adf'
| make: *** [adf] Error 2
| make: Leaving directory `/tune-test/bitbake_build/tmp/work/intel_xeon_core-wrs-linux/qat-cck-1.0.1-15-r1/quickassist'
| ERROR: oe_runmake failed
| WARNING: /tune-test/bitbake_build/tmp/work/intel_xeon_core-wrs-linux/qat-cck-1.0.1-15-r1/temp/do_compile/run.do_compile.12938:114 exit 1 from
|   exit 1
| ERROR: Function failed: do_compile (see /tune-test/bitbake_build/tmp/work/intel_xeon_core-wrs-linux/qat-cck-1.0.1-15-r1/temp/do_compile/log.do_compile.12938 for further information)
ERROR: Task 552 (/tune-test/bitbake_build/../layers/wr-intel-support/recipes-quickassist/qat-cck/qat-cck_1.0.1-15.bb, do_compile) failed with exit code '1'
NOTE: Tasks Summary: Attempted 7221 tasks of which 7163 didn't need to be rerun and 2 failed.
Waiting for 0 running tasks to finish:

Summary: 2 tasks failed:
  /tune-test/bitbake_build/../layers/wr-intel-support/recipes-dpdk/dpdk/dpdk_1.3.0-183.bb,do_compile_examples
  /tune-test/bitbake_build/../layers/wr-intel-support/recipes-quickassist/qat-cck/qat-cck_1.0.1-15.bb, do_compile
Summary: There were 2 ERROR messages shown, returning a non-zero exit code.
make: *** [export/intel-xeon-core-glibc-std-sato-standard-dist.tar.bz2] Error 1


Misc Info
======================

Steps to Reproduce

1. configure --enable-kernel=standard --enable-rootfs=glibc-std-sato --enable-board=intel-xeon-core --enable-test=yes --with-layer=wr-intel-support,wr-features --with-template=feature/intel-support,feature/intel-qat,feature/intel-dpdk,feature/intel-amt,feature/compat-wireless,feature/kvm,feature/kexec,feature/kdump,feature/edac,feature/intel-ras,feature/haswell --enable-internet-download=yes --enable-reconfig=yes

2. make fs -j16

Other Downloads


Live chat
Online