Wind River Support Network

HomeDefectsLIN5-2411
Fixed

LIN5-2411 : [ovirt-engine] build autogen-native failed in frequency

Created: Oct 22, 2013    Updated: Dec 19, 2017
Resolved Date: Dec 1, 2013
Found In Version: 5.0.1
Fix Version: 5.0.1.10
Severity: Severe
Applicable for: Wind River Linux 5
Component/s: Userspace

Description

Problem Description
======================
[ovirt-engine] build autogen-native failed in frequency

Expected Behavior
======================
it works well

Observed Behavior
======================
None

Logs
======================
log.do_compile.212285, detail logs attached
------------------------------
make[3]: Entering directory `/project/bitbake_build/tmp/work/x86_64-linux/autogen-native-5.12-r3/autogen-5.12/agen5'
exec > ag.c ; \
        echo '#undef   PKGDATADIR' ; \
        echo '#define  PKGDATADIR "/project/bitbake_build/tmp/sysroots/x86_64-linux/usr/share/autogen"' ; \
        mk=`set -- make ; which $1` ; \
        echo 'static char const zMakeProg[] = "'$mk'";' ; \
        echo ; echo '#define  DEFINING' ; \
        echo '#include "autoopts/project.h"' ; \
        echo '#include "autoopts/ag-char-map.h"' ; \
        echo '#include "autogen.h"' ; \
        for f in autogen.c    cgi-fsm.c defParse-fsm.c expExtract.c expFormat.c expGperf.c expGuile.c  expMake.c expOutput.c  expPrint.c  expState.c expString.c funcCase.c funcDef.c funcEval.c funcFor.c funcIf.c functions.c agCgi.c      agInit.c agShell.c  agUtils.c defDirect.c  defFind.c    defLex.c   defLoad.c fmemopen.c   loadPseudo.c opts.c     scmStrings.c tpLoad.c tpParse.c    tpProcess.c ; do echo "#include \"$f\"" ; done
gcc -std=gnu99 -DHAVE_CONFIG_H -I. -I.. -I.. -I../autoopts -isystem/project/bitbake_build/tmp/sysroots/x86_64-linux/usr/include -pthread -I/project/bitbake_build/tmp/sysroots/x86_64-linux/usr/include/guile/2.0 -I/project/bitbake_build/tmp/sysroots/x86_64-linux/usr/include -isystem/project/bitbake_build/tmp/sysroots/x86_64-linux/usr/include -O2 -pipe -c -o autogen-ag.o `test -f 'ag.c' || echo './'`ag.c
In file included from ag.c:8:0:
autogen.h:33:19: error: operator '<' has no left operand
In file included from autogen.h:40:0,
                 from ag.c:8:
expr.h:28:19: error: operator '>=' has no left operand
expr.h:31:23: fatal error: guile/gh.h: No such file or directory
compilation terminated.
make[3]: *** [autogen-ag.o] Error 1
make[3]: Leaving directory `/project/bitbake_build/tmp/work/x86_64-linux/autogen-native-5.12-r3/autogen-5.12/agen5'
make[2]: *** [all-recursive] Error 1
make[2]: Leaving directory `/project/bitbake_build/tmp/work/x86_64-linux/autogen-native-5.12-r3/autogen-5.12/agen5'
make[1]: *** [all-recursive] Error 1
make[1]: Leaving directory `/project/bitbake_build/tmp/work/x86_64-linux/autogen-native-5.12-r3/autogen-5.12'
make: *** [all] Error 2
ERROR: oe_runmake failed
WARNING: exit code 1 from a shell command.
ERROR: Function failed: do_compile (see /project/bitbake_build/tmp/work/x86_64-linux/autogen-native-5.12-r3/temp/do_compile/log.do_compile.212285 for further information)
(END)

Workaround

make -C build autogen-native.distclean ; make -C build autogen-native ; make fs

Steps to Reproduce

1) /lwrlinuxovp/wrlinux-x/wrlinux/configure --enable-board=intel-xeon-core --enable-rootfs=ovp-ovirt-engine --enable-addons=wr-ovp --with-package=wrs-kvm-helper --enable-parallel-pkgbuilds=24 --enable-jobs=24 --with-rcpl-version=0

2) make fs

Check the behaving and logs.

Other Downloads


Live chat
Online