Wind River Support Network

HomeDefectsLIN5-19089
Fixed

LIN5-19089 : groff.texinfo fails to build with Texinfo 5.1

Created: Jul 21, 2014    Updated: Dec 19, 2017
Resolved Date: Jul 21, 2014
Found In Version: 5.0.1.17
Fix Version: 5.0.1.17
Severity: Standard
Applicable for: Wind River Linux 5
Component/s: Userspace

Description

| makeinfo --enable-encoding -I. ./groff.texinfo
| ./groff.texinfo:11934: macro `Defesc' called with too many args
| make[2]: *** [groff.info] Error 1
| make[2]: Leaving directory `/build/qemux86-64_6.0/bitbake_build/tmp/work/x86_64-linux/groff-native/1.22.2-r2.0/groff-1.22.2/doc'
| make[1]: *** [doc] Error 2
| make[1]: Leaving directory `/build/qemux86-64_6.0/bitbake_build/tmp/work/x86_64-linux/groff-native/1.22.2-r2.0/groff-1.22.2'
| make: *** [all] Error 2
| ERROR: oe_runmake failed
| WARNING: /build/qemux86-64_6.0/bitbake_build/tmp/work/x86_64-linux/groff-native/1.22.2-r2.0/temp/do_compile/run.do_compile.24864:1 exit 1 from
|   exit 1
| ERROR: Function failed: do_compile (log file is located at /build/qemux86-64_6.0/bitbake_build/tmp/work/x86_64-linux/groff-native/1.22.2-r2.0/temp/do_compile/log.do_compile.24864)
ERROR: Task 142 (virtual:native:/build/qemux86-64_6.0/layers/oe-core/meta/recipes-extended/groff/groff_1.22.2.bb, do_compile) failed with exit code '1'
NOTE: Tasks Summary: Attempted 711 tasks of which 702 didn't need to be rerun and 1 failed.
No currently running tasks (711 of 726)

Other Downloads


Live chat
Online