Wind River Support Network

HomeDefectsLIN5-18987
Fixed

LIN5-18987 : Building inetutils failed on CentOS release 6.3

Created: Jun 26, 2014    Updated: Dec 19, 2017
Resolved Date: Jun 26, 2014
Found In Version: 5.0
Fix Version: 5.0.1.17
Severity: Standard
Applicable for: Wind River Linux 5
Component/s: Userspace

Description

Setting up host-cross and links
Setting up packages link
Creating export directory
Creating project properties
Loading cache: 100% |##################################################################################################################################| ETA:  00:00:00
Loaded 1414 entries from dependency cache.
Parsing recipes: 100% |################################################################################################################################| Time: 00:00:01
Parsing of 1082 .bb files complete (1079 cached, 3 parsed). 1415 targets, 77 skipped, 6 masked, 0 errors.
| make[3]: Entering directory `/build/LIN5-18948/bitbake_build/tmp/work/armv7a-vfp-wrs-linux-gnueabi/inetutils-1.9.1-r6/inetutils-1.9.1/ping'
|       then \
|         rc=0; \
|         CDPATH="${ZSH_VERSION+.}:" && cd .; \
|       else \
|         rc=$?; \
|         CDPATH="${ZSH_VERSION+.}:" && cd . && \
|         $restore $backupdir/* `echo "./inetutils.info" | sed 's|[^/]*$||'`; \
|       fi; \
|       rm -rf $backupdir; exit $rc
| inetutils.texi:459: @itemx must follow @item
| inetutils.texi:663: command @bullet not accepting argument in brace should not be on @table line
| inetutils.texi:664: warning: @item missing argument
| inetutils.texi:669: warning: @item missing argument
| inetutils.texi:675: warning: @item missing argument
| inetutils.texi:866: @itemx must follow @item
| inetutils.texi:1703: warning: node next `rlogin invocation' in menu `rexec invocation' and in sectioning `rcp invocation' differ
| inetutils.texi:1822: warning: node next `rcp invocation' in menu `talk invocation' and in sectioning `rexec invocation' differ
| inetutils.texi:1822: warning: node prev `rcp invocation' in menu `rexec invocation' and in sectioning `rlogin invocation' differ
| inetutils.texi:1889: warning: node next `rexec invocation' in menu `rcp invocation' and in sectioning `talk invocation' differ
| inetutils.texi:1889: warning: node prev `rexec invocation' in menu `rlogin invocation' and in sectioning `rcp invocation' differ
| inetutils.texi:1925: warning: node prev `talk invocation' in menu `rcp invocation' and in sectioning `rexec invocation' differ
| make[2]: *** [inetutils.info] Error 1
| make[2]: Leaving directory `/build/LIN5-18948/bitbake_build/tmp/work/armv7a-vfp-wrs-linux-gnueabi/inetutils-1.9.1-r6/inetutils-1.9.1/doc'
| make[1]: *** [install-recursive] Error 1
| make[1]: Leaving directory `/build/LIN5-18948/bitbake_build/tmp/work/armv7a-vfp-wrs-linux-gnueabi/inetutils-1.9.1-r6/inetutils-1.9.1'
| make: *** [install] Error 2
| ERROR: oe_runmake failed
| WARNING: /build/LIN5-18948/bitbake_build/tmp/work/armv7a-vfp-wrs-linux-gnueabi/inetutils-1.9.1-r6/temp/do_install/run.do_install.3944:140 exit 1 from
|   exit 1
| ERROR: Function failed: do_install (see /build/LIN5-18948/bitbake_build/tmp/work/armv7a-vfp-wrs-linux-gnueabi/inetutils-1.9.1-r6/temp/do_install/log.do_install.3944 for further information)
ERROR: Task 2 (/build/LIN5-18948/layers/wr-features/recipes-networking/inetutils/inetutils_1.9.1.bb, do_install) failed with exit code '1'
NOTE: Tasks Summary: Attempted 683 tasks of which 647 didn't need to be rerun and 1 failed.
No currently running tasks (683 of 688)

Other Downloads


Live chat
Online